{"text_format":"1","workbook":"xlsx","n_sheets":3,"sheets":["Input","Size Distribution Curve","Data"],"not_rendered":{"charts":1,"images":0,"macros":1,"external_links":0,"defined_names":19,"comments":0,"pivot_tables":0},"unopened":[],"bounds":{"document_bytes":16777216,"sheet_cells":100000,"rows_first":2000,"rows_last":500,"rows_between":2000,"halvings":0,"cell_chars":16384,"cell_head_chars":4096},"cells_cut":0,"cells_raw":0,"read":"whole","date_system":"1900"}

{"sheet":"Input","index":0,"n_rows":60,"n_cols":13,"rows_kept":60,"cut":false,"hidden":false,"merged":[[1,2,3,3],[1,5,3,6],[1,11,3,11],[1,10,3,10],[30,10,30,11],[25,10,25,11],[26,10,26,11],[28,7,28,9],[27,10,27,11],[35,10,35,11],[29,7,29,9],[26,7,26,9],[25,7,25,9],[29,10,29,11],[28,10,28,11],[34,8,34,9],[34,10,34,11],[31,10,31,11],[32,7,32,9],[33,7,33,9],[32,10,32,11],[33,10,33,11]]}
[null,"Directions:"]
[null,"1) Select software version installed on the SDG","Sieve Conversions  ",null,null,"Sieve Conversions  ",null,null,null,null,"Sieve Size (mm)      (A)","% Passing (B)"]
[null,"2) Define the material as described below"]
[null,"3) View the particle distribution curve and material properties"]
[null,"4) Save the material file in the desired location",null,null,null,null,null,null,null,null,0,0]
[null,null,"SI","Metric",null,"SI","Metric",null,null,null,0,0," "]
[null,"Define Materials As Follows:","4\" ","100 mm ",null,"No. 3-1/2 ","5.6 mm ",null,null,null,0,0]
[null,"1) Enter the sieve sizes, in mm, in descending order, in Column A","3-1/2\" ","90 mm ",null,"No. 4 ","4.75 mm ",null,null,null,0,0]
[null,"2) Enter the percent passing each sieve (% finer) in Column B","3\" ","75 mm ",null,"No. 5 ","4.00 mm ",null,null,null,0,0]
[null,"3) Enter the  Soil ID (Up to 8 characters, numbers only)","2-1/2\" ","63 mm ",null,"No. 6 ","3.35 mm ",null,null,null,0,0]
[null,"4) Enter the Material Description (Up to 16 characters, alpha/numeric)","2.12\" ","53 mm ",null,"No. 7 ","2.80 mm ",null,null,null,0,0]
[null,"5) Enter the Maximum dry density in pcf or kg/m³","2\" ","50 mm ",null,"No. 8 ","2.36 mm ",null,null,null,0,0]
[null,"6) Enter the optimum moisture content in percent ","1-3/4\" ","45 mm ",null,"No. 10 ","2.00 mm ",null,null,null,0,0]
[null,"7) Enter the plastic limit","1-1/2\" ","37.5 mm ",null,"No. 12 ","1.70 mm ",null,null,null,0,0]
[null,"8) Enter the liquid limit","1-1/4\" ","31.5 mm ",null,"No. 14 ","1.40 mm ",null,null,null,0,0]
[null,"9) Enter the material file name(maximum of 8 characters)","1.06\" ","26.5 mm ",null,"No. 16 ","1.18 mm ",null,null,null,0,0]
[null,null,"1\" ","25.0 mm ",null,"No. 18 ","1.00 mm ",null,null,null,0,0]
[null,"Limitations:","7/8\" ","22.4 mm ",null,"No. 20 ","0.850mm",null,null,null,0,0]
[null,"1) D10, D30, and D60 are only calculated if the percent passing the smallest ","3/4\" ","19.0 mm ",null,"No. 25 ","0.710mm",null,null,null,0,0]
[null,"    sieve is less than 10, 30, or 60%.  When D10, D30 or D60 are not calculated, d10, ","5/8\" ","16.0 mm ",null,"No. 30 ","0.600mm",null,null,null,0,0]
[null,"   d30 and d60 will be calculated from an extrapolation of the particle size distribution","0.530\" ","13.2 mm ",null,"No. 35 ","0.500mm",null,null,null,0,0]
[null,"  curve.  Cu and Cc values calculated from d10, d30, and d60 are not automatically","1/2\" ","12.5 mm ",null,"No. 40 ","0.425mm",null,null,null,0,0]
[null,"  imported to the SDG, they need to be manually entered at the operators discretion.","7/16\" ","11.2 mm ",null,"No. 45 ","0.355mm",null,null,null,0,0]
[null,"2) If 3\", 3/4\", #4, #200 Sieves are not used, the values of % Sand, % Gravel, % Fines, ","3/8\" ","9.5 mm ",null,"No. 50 ","0.300mm",null,null,null,0,0]
[null,"    %>3, and %>3/4 are interpolated from the gradation data entered","5/16\" ","8.0 mm ",null,"No. 60 ","0.250mm"]
[null,"3) D10, D30, and D60 values are interpolated from the plot shown and are subject ","0.265\" ","6.7 mm ",null,"No. 70 ","0.212mm","Description:"]
[null,"    to the error in the interpolation method","1/4\" ","6.3 mm ",null,"No. 80 ","0.180mm","Soil ID:"]
[null,"View Size Distribution Curve",null,null,null,"No. 100 ","0.150mm",null,null,"Depth:"]
[null,null,null,null,null,"No. 120 ","0.125mm","Max Dry Density:"]
[null,null,null,null,null,"No. 140 ","0.106mm","Optimum Moisture Content:"]
[null,null,null,null,null,"No. 170 ","0.090mm",null,null,"WD Offset:"]
[null,null,null,null,null,"No. 200 ","0.075mm",null,null,"% Moisture Offset:"]
[null,"Troubleshooting:",null,null,null,"No. 230 ","0.063mm","PL:"]
[null,"1) Sieve Sizes in Column A need to be entered in descending order.",null,null,null,"No. 270 ","0.053mm","LL:"]
[null,"2) Values in Column B will also be in descending order, for example, the % passing",null,null,null,"No. 325 ","0.045mm",null,"Material File Name"]
[null,"       the 25mm sieve will never be greater than the % passing the 50mm sieve.",null,null,null,"No. 400 ","0.038mm"]
[null,"3) The SDG will not recognize the file unless it has a .mtl extension.",null,null,null,"No. 450 ","0.032mm"]
[null,"4) The SDG will not recognize the file unless its name is 8 characters or less.",null,null,null,"No. 500 ","0.025mm"]
[null,"5) The SDG will only recognize the first 20 .mtl files saved on the flash drive.",null,null,null,"No. 635 ","0.020mm"]
[null,"6) The SDG will only recognize the .mtl files in the root directory of the flash drive.  Any"]
[null,"     .mtl files saved in folders on the flash drive cannot be transferred to the SDG."]
[null,"7) Any unused cells in Column A need to have zero entered in them."]
[null,"8) Any unused cells in Column B need a zero entered in them."]
[null,"9) All files generated by this spreadsheet are initially saved to your Desktop."]
[null,"10) The first time your PC tries to open the .mtl file it will not be able to.  Find the file on the desk top, "]
[null,"      double click on it and open it with WordPad. All .mtl files will open properly after that."]
[]
[]
[]
[]
[]
[]
[]
[]
[]
[]
[]
[]
[]
[" "]

{"sheet":"Size Distribution Curve","index":1,"n_rows":116,"n_cols":21,"rows_kept":116,"cut":false,"hidden":false,"merged":[[37,16,37,17],[32,18,32,20],[33,18,33,20],[0,5,0,7],[1,5,1,7],[41,16,41,17],[34,16,34,17],[35,16,35,17],[36,16,36,17],[34,18,34,20],[40,16,40,17],[26,16,26,17],[25,16,25,17],[39,16,39,17],[38,16,38,17],[33,16,33,17],[32,16,32,17],[28,18,28,20],[29,18,29,20],[30,18,30,20],[31,18,31,20],[31,16,31,17],[28,16,28,17],[30,16,30,17],[29,16,29,17],[1,19,1,20],[24,16,24,20],[25,18,25,20],[26,18,26,20],[27,18,27,20],[27,16,27,17],[41,18,41,20],[35,18,35,20],[36,18,36,20],[37,18,37,20],[38,18,38,20],[39,18,39,20],[40,18,40,20]]}
["Soil ID;",{"$f":"ID","v":0},null,null,null,"Max Dry Density;",null,null,{"$f":"MDD","v":0},{"$f":"Units","v":0},null,"LL;",{"$f":"LL","v":0},null,null,null,null," "]
["Description;",{"$f":"Desc","v":0},null,null,null,"Optimum Moisture Content;",null,null,{"$f":"OMC","v":0},null,null,"PL;",{"$f":"PL","v":0},null,null,null,"Gradation;",null,null,"Extrapolated Coefficients (see Limitations on Input Screen)"]
[null,null,null,null,null,null,null,null,null,null,null,null,null,null,null,null,"Sieve (mm)","% Passing",null,"d10",{"$f":"Data!C8","v":0}]
[null,null,null,null,null,null,null,null,null,null,null,null,null,null,null,null,{"$f":"IF(Input!K5=0,\"\",Input!K5)","v":""},{"$f":"Input!L5","v":0},null,"d30",{"$f":"Data!C9","v":0}]
[null,null,null,null,null,null,null,null,null,null,null,null,null,null,null,null,{"$f":"IF(Input!K6=0,\"\",Input!K6)","v":""},{"$f":"Input!L6","v":0},null,"d60",{"$f":"Data!C10","v":0}]
[null,null,null,null,null,null,null,null,null,null,null,null,null,null,null,null,{"$f":"IF(Input!K7=0,\"\",Input!K7)","v":""},{"$f":"Input!L7","v":0},null,"Cu",{"$f":"IFERROR(Data!C10/Data!C8,0)","v":0}]
[null,null,null,null,null,null,null,null,null,null,null,null,null,null,null,null,{"$f":"IF(Input!K8=0,\"\",Input!K8)","v":""},{"$f":"Input!L8","v":0},null,"Cc",{"$f":"IFERROR((Data!C9^2)/(Data!C10*Data!C8),0)","v":0}]
[null,null,null,null,null,null,null,null,null,null,null,null,null,null,null,null,{"$f":"IF(Input!K9=0,\"\",Input!K9)","v":""},{"$f":"Input!L9","v":0}]
[null,null,null,null,null,null,null,null,null,null,null,null,null,null,null,null,{"$f":"IF(Input!K10=0,\"\",Input!K10)","v":""},{"$f":"Input!L10","v":0}]
[null,null,null,null,null,null,null,null,null,null,null,null,null,null,null,null,{"$f":"IF(Input!K11=0,\"\",Input!K11)","v":""},{"$f":"Input!L11","v":0}]
[null,null,null,null,null,null,null,null,null,null,null,null,null,null,null,null,{"$f":"IF(Input!K12=0,\"\",Input!K12)","v":""},{"$f":"Input!L12","v":0}]
[null,null,null,null,null,null,null,null,null,null,null,null,null,null,null,null,{"$f":"IF(Input!K13=0,\"\",Input!K13)","v":""},{"$f":"Input!L13","v":0}]
[null,"Input Screen",null,null,null,null,null,null,null,null,null,null,null,null,null,null,{"$f":"IF(Input!K14=0,\"\",Input!K14)","v":""},{"$f":"IF(Input!L14=0,\"\",Input!L14)","v":""}]
[null,null,null,null,null,null,null,null,null,null,null,null,null,null,null,null,{"$f":"IF(Input!K15=0,\"\",Input!K15)","v":""},{"$f":"IF(Input!L15=0,\"\",Input!L15)","v":""}]
[null,"Distribution Curve",null,null,null,null,null,null,null,null,null,null,null,null,null,null,{"$f":"IF(Input!K16=0,\"\",Input!K16)","v":""},{"$f":"IF(Input!L16=0,\"\",Input!L16)","v":""}]
[null,null,null,null,null,null,null,null,null,null,null,null,null,null,null,null,{"$f":"IF(Input!K17=0,\"\",Input!K17)","v":""},{"$f":"IF(Input!L17=0,\"\",Input!L17)","v":""}]
[null,null,null,null,null,null,null,null,null,null,null,null,null,null,null,null,{"$f":"IF(Input!K18=0,\"\",Input!K18)","v":""},{"$f":"IF(Input!L18=0,\"\",Input!L18)","v":""}]
[null,null,null,null,null,null,null,null,null,null,null,null,null,null,null,null,{"$f":"IF(Input!K19=0,\"\",Input!K19)","v":""},{"$f":"IF(Input!L19=0,\"\",Input!L19)","v":""}]
[null,null,null,null,null,null,null,null,null,null,null,null,null,null,null,null,{"$f":"IF(Input!K20=0,\"\",Input!K20)","v":""},{"$f":"IF(Input!L20=0,\"\",Input!L20)","v":""}]
[null,null,null,null,null,null,null,null,null,null,null,null,null,null,null,null,{"$f":"IF(Input!K21=0,\"\",Input!K21)","v":""},{"$f":"IF(Input!L21=0,\"\",Input!L21)","v":""}]
[null,null,null,null,null,null,null,null,null,null,null,null,null,null,null,null,{"$f":"IF(Input!K22=0,\"\",Input!K22)","v":""},{"$f":"IF(Input!L22=0,\"\",Input!L22)","v":""}]
[null,null,null,null,null,null,null,null,null,null,null,null,null,null,null,null,{"$f":"IF(Input!K23=0,\"\",Input!K23)","v":""},{"$f":"IF(Input!L23=0,\"\",Input!L23)","v":""}]
[null,null,null,null,null,null,null,null,null,null,null,null,null,null,null,null,{"$f":"IF(Input!K24=0,\"\",Input!K24)","v":""},{"$f":"IF(Input!L24=0,\"\",Input!L24)","v":""}]
[]
[null,null,null,null,null,null,null,null,null,null,null,null,null,null,null,null,"Material Properties"]
[null,null,null,null,null,null,null,null,null,null,null,null,null,null,null,null,"Description =",null,{"$f":"Desc","v":0}]
[null,null,null,null,null,null,null,null,null,null,null,null,null,null,null,null,"Soil ID =",null,{"$f":"ID","v":0}]
[null,null,null,null,null,null,null,null,null,null,null,null,null,null,null,null,"Depth =",null,{"$f":"Depth","v":0}]
[null,null,null,null,null,null,null,null,null,null,null,null,null,null,null,null,"Max Dry Density =",null,{"$f":"MDD","v":0}]
[null,null,null,null,null,null,null,null,null,null,null,null,null,null,null,null,"Optimum Moisture =",null,{"$f":"OMC","v":0}]
[null,null,null,null,null,null,null,null,null,null,null,null,null,null,null,null,"WD Offset = ",null,{"$f":"WDos","v":0}]
[null,null,null,null,null,null,null,null,null,null,null,null,null,null,null,null,"% Moisture Offset = ",null,{"$f":"wos","v":0}]
[null,null,null,null,null,null,null,null,null,null,null,null,{"$f":"Input!K35","v":0},null,null,null,"% > 3 in. = ",null,{"$f":"100-Data!B29","v":100}]
[null,null,null,null,null,null,null,null,null,null,null,null,null,null,null,null,"% > 3/4 in. =",null,{"$f":"100-Data!B32","v":100}]
[null,null,null,null,null,null,null,null,null,null,null,null,null,null,null,null,"% Gravel = ",null,{"$f":"Data!C29","v":0}]
[null,null,null,null,null,null,null,null,null,null,null,null,null,null,null,null,"% Sand =",null,{"$f":"Data!C30","v":0}]
[null,null,null,null,null,null,null,null,null,null,null,null,null,null,null,null,"% Fines =",null,{"$f":"Data!C31","v":0}]
[null,null,null,null,null,null,null,null,null,null,null,null,null,null,null,null,"PL =",null,{"$f":"PL","v":0}]
[null,null,null,null,null,null,null,null,null,null,null,null,null,null,null,null,"LL =",null,{"$f":"LL","v":0}]
[null,"View Input",null,null,null,null,null,null,null,null,null,null,null,null,null,null,"Cu = ",null,{"$f":"IFERROR(IF(Data!D8=\"D10=0\",0,Data!C10/Data!C8),0)","v":0}]
[null,null,null,null,null,null,null,null,null,null,null,null,null,null,null,null,"Cc = ",null,{"$f":"IFERROR(IF(Data!D8=\"D10=0\",0,(Data!C9^2)/(Data!C10*Data!C8)),0)","v":0}]
[null,null,null,null,null,null,null,null,null,null,null,null,null,null,null,null,"File Name",null,{"$f":"Input!K35","v":0}]
[]
[]
[]
[]
[]
[]
[]
[]
[]
[]
[]
[]
[]
[]
[]
[]
[]
[]
[]
[]
[]
[]
[]
[]
[]
[]
[]
[]
[]
[]
[]
[]
[]
[]
[]
[]
[]
[]
[]
[]
[]
[]
[]
[]
[]
[]
[]
[]
[]
[]
[]
[]
[]
[]
[]
[100]
[1]
[{"$f":"Desc&\";\"&ID&\";\"&A103&\";\"&A104&\";\"&A105&\";\"&A106&\";\"&A107&\";\"&A108&\";\"&A109&\";\"&A110&\";\"&A111&\";\"&A112&\";\"&A113&\";\"&A114&\";\"&A115&\";\"&A116","v":";;0;0.00;0.00;0;0;100.00;100.00;0.00;0.00;0.00;0.00;0.00;0.00;0.00"}]
[]
[]
[{"$f":"Depth","v":0},"depth"]
[{"$f":"FIXED(S29,2)","v":"0.00"},"mdd"]
[{"$f":"FIXED(S30,2)","v":"0.00"},"optm"]
[{"$f":"WDos","v":0},"WD offset"]
[{"$f":"wos","v":0},"moisture offset"]
[{"$f":"FIXED(S33,2)","v":"100.00"},0.03]
["100.00","%3/4"]
["0.00","%g"]
["0.00","%s"]
["0.00","%f"]
["0.00","pl"]
["0.00","ll"]
["0.00","cu"]
["0.00","cc"]

{"sheet":"Data","index":2,"n_rows":1004,"n_cols":23,"rows_kept":1004,"cut":false,"hidden":true,"merged":[[1,5,1,6],[61,0,61,2],[26,0,26,4],[6,0,6,2]]}
[]
[null,null,null,null,null," ",null,null,null,"Extrapolated"]
[null,null,null,null,null,"Y Value","X Value","X Plotted ","Y Plotted","y Ploted ",null,"Y Plotted values are only the values that are greater in diameter than the #200 sieve (.075mm)",null,null,null,null,null,null,null,null,null,"#60",{"$f":"IF($T$21=\"#200\",0.075,IF($T$21=\"#140\",0.106,IF($T$21=\"#100\",0.15,IF($T$21=\"#60\",0.25,IF($T$21=\"#50\",0.3,IF($T$21=\"#40\",0.425,\"ERROR\"))))))","v":"ERROR"}]
[null,null,null,null,null,0.01,{"$f":"cubspline(3,F4,Data!$B$36:$B$56,Data!$A$36:$A$56)","v":0},{"$f":"IF(G4<=0,0.0000000001,G4)","v":1E-10},{"$f":"IF(F4>$D$47,F4,NA())","v":0.01},{"$f":"IF(F4>=$D$47,F4,($D$47-(0.3*($D$47-F4))))","v":0.01},null,"X Plotted values are forced to be greater than zero"]
[null,null,null,null,null,{"$f":"F4+0.1","v":0.11},{"$f":"cubspline(3,F5,Data!$B$36:$B$56,Data!$A$36:$A$56)","v":0},{"$f":"IF(G5<=0,0.0000000001,G5)","v":1E-10},{"$f":"IF(F5>$D$47,F5,NA())","v":0.11},{"$f":"IF(F5>=$D$47,F5,($D$47-(0.3*($D$47-F5))))","v":0.11},null,"D10 Logic prevents d10 from being calculated when it is less than the smallest sieve used in the gradation analysis"]
[null,null,null,null,"Interpolated",{"$f":"F5+0.1","v":0.21000000000000002},{"$f":"cubspline(3,F6,Data!$B$36:$B$56,Data!$A$36:$A$56)","v":0},{"$f":"IF(G6<=0,0.0000000001,G6)","v":1E-10},0.21000000000000002,0.21000000000000002,null,"Extrapolated Y Plotted - not used - prevents y value from approaching zero - approaches approximately 70% of percent passing smallest sieve"]
["Inputs for Cu, Cc",null,null,"D10 Logic","D10, 30, 60",0.31000000000000005,{"$f":"cubspline(3,F7,Data!$B$36:$B$56,Data!$A$36:$A$56)","v":0},1E-10,0.31000000000000005,0.31000000000000005,null,"Inputs for Cu, Cc on Extrapolated Line - not used - Cu, Cc from above - not used because it can prevent Cu and Cc from being calculated if 70% of the percent passing the smallest sieve is still greater than 60. 30, or 10%"]
["D10",10,{"$f":"cubspline(3,B8,Data!$B$36:$B$56,Data!$A$36:$A$56)","v":0},{"$f":"IF(C8<$D$44,\"D10=0\",C8)","v":0},{"$f":"IF(C8=D8,\"n/a\", C8)","v":"n/a"},0.41000000000000003,{"$f":"cubspline(3,F8,Data!$B$36:$B$56,Data!$A$36:$A$56)","v":0},1E-10,0.41000000000000003,0.41000000000000003]
["D30",30,{"$f":"cubspline(3,B9,Data!$B$36:$B$56,Data!$A$36:$A$56)","v":0},{"$f":"IF(C9<$D$44,\"D30=0\",C9)","v":0},{"$f":"IF(C9=D9,\"n/a\", C9)","v":"n/a"},0.51,{"$f":"cubspline(3,F9,Data!$B$36:$B$56,Data!$A$36:$A$56)","v":0},1E-10,0.51,0.51]
["D60",60,{"$f":"cubspline(3,B10,Data!$B$36:$B$56,Data!$A$36:$A$56)","v":0},{"$f":"IF(C10<$D$44,\"D60=0\",C10)","v":0},{"$f":"IF(C10=D10,\"n/a\", C10)","v":"n/a"},0.61,{"$f":"cubspline(3,F10,Data!$B$36:$B$56,Data!$A$36:$A$56)","v":0},1E-10,0.61,0.61]
["D#200",{"$f":"B31","v":0},{"$f":"cubspline(3,B11,Data!$B$36:$B$56,Data!$A$36:$A$56)","v":0},null,null,0.71,{"$f":"cubspline(3,F11,Data!$B$36:$B$56,Data!$A$36:$A$56)","v":0},1E-10,0.71,0.71]
[null,null,null,null,null,0.80999999999999994,{"$f":"cubspline(3,F12,Data!$B$36:$B$56,Data!$A$36:$A$56)","v":0},1E-10,0.80999999999999994,0.80999999999999994]
["Inputs for Cu, Cc on Extrapolated Line",null,null,null,null,0.90999999999999992,{"$f":"cubspline(3,F13,Data!$B$36:$B$56,Data!$A$36:$A$56)","v":0},1E-10,0.90999999999999992,0.90999999999999992]
["d10",10,{"$f":"cubspline(3,B14,Data!$J$4:$J$1004,Data!$H$4:$H$1004)","v":1E-10},null,null,1.01,{"$f":"cubspline(3,F14,Data!$B$36:$B$56,Data!$A$36:$A$56)","v":0},1E-10,1.01,1.01]
["d30",30,{"$f":"cubspline(3,B15,Data!$J$4:$J$1004,Data!$H$4:$H$1004)","v":1E-10},null,null,1.1100000000000001,{"$f":"cubspline(3,F15,Data!$B$36:$B$56,Data!$A$36:$A$56)","v":0},1E-10,1.1100000000000001,1.1100000000000001]
["d60",60,{"$f":"cubspline(3,B16,Data!$J$4:$J$1004,Data!$H$4:$H$1004)","v":1E-10},null,null,1.2100000000000002,{"$f":"cubspline(3,F16,Data!$B$36:$B$56,Data!$A$36:$A$56)","v":0},1E-10,1.2100000000000002,1.2100000000000002]
[null,null,null,null,null,1.3100000000000003,{"$f":"cubspline(3,F17,Data!$B$36:$B$56,Data!$A$36:$A$56)","v":0},1E-10,1.3100000000000003,1.3100000000000003]
[null,null,null,null,null,1.4100000000000004,{"$f":"cubspline(3,F18,Data!$B$36:$B$56,Data!$A$36:$A$56)","v":0},1E-10,1.4100000000000004,1.4100000000000004]
[null,null,null,null,null,1.5100000000000005,{"$f":"cubspline(3,F19,Data!$B$36:$B$56,Data!$A$36:$A$56)","v":0},1E-10,1.5100000000000005,1.5100000000000005]
[null,null,null,null,null,1.6100000000000005,{"$f":"cubspline(3,F20,Data!$B$36:$B$56,Data!$A$36:$A$56)","v":0},{"$f":"IF(G20<=0,0.0000000001,G20)","v":1E-10},1.6100000000000005,1.6100000000000005]
[null,null,null,null,null,1.7100000000000006,{"$f":"cubspline(3,F21,Data!$B$36:$B$56,Data!$A$36:$A$56)","v":0},1E-10,1.7100000000000006,1.7100000000000006]
[null,null,null,null,null,1.8100000000000007,{"$f":"cubspline(3,F22,Data!$B$36:$B$56,Data!$A$36:$A$56)","v":0},1E-10,1.8100000000000007,1.8100000000000007]
[null,null,null,null,null,1.9100000000000008,{"$f":"cubspline(3,F23,Data!$B$36:$B$56,Data!$A$36:$A$56)","v":0},1E-10,1.9100000000000008,1.9100000000000008]
[null,null,null,null,null,2.0100000000000007,{"$f":"cubspline(3,F24,Data!$B$36:$B$56,Data!$A$36:$A$56)","v":0},1E-10,2.0100000000000007,2.0100000000000007]
[null,null,null,null,null,2.1100000000000008,{"$f":"cubspline(3,F25,Data!$B$36:$B$56,Data!$A$36:$A$56)","v":0},1E-10,2.1100000000000008,2.1100000000000008]
[null,null,null,null,null,2.2100000000000009,{"$f":"cubspline(3,F26,Data!$B$36:$B$56,Data!$A$36:$A$56)","v":0},1E-10,2.2100000000000009,2.2100000000000009]
["Percentages of Sand, Gravel, Fines, +3, +3/4",null,null,null,null,2.3100000000000009,{"$f":"cubspline(3,F27,Data!$B$36:$B$56,Data!$A$36:$A$56)","v":0},1E-10,2.3100000000000009,2.3100000000000009]
["Sieve mm",null,{"$f":"100-B29","v":100},null,null,2.410000000000001,{"$f":"cubspline(3,F28,Data!$B$36:$B$56,Data!$A$36:$A$56)","v":0},1E-10,2.410000000000001,2.410000000000001]
[75,{"$f":"IF(cubspline(3,A29,Data!$A$36:$A$56,Data!$B$36:$B$56)<100,(cubspline(3,A29,Data!$A$36:$A$56,Data!$B$36:$B$56)),100)","v":0},{"$f":"B29-B30","v":0},null,null,2.5100000000000011,{"$f":"cubspline(3,F29,Data!$B$36:$B$56,Data!$A$36:$A$56)","v":0},1E-10,2.5100000000000011,2.5100000000000011]
[4.75,{"$f":"IF(cubspline(3,A30,Data!$A$36:$A$56,Data!$B$36:$B$56)<100,(cubspline(3,A30,Data!$A$36:$A$56,Data!$B$36:$B$56)),100)","v":0},{"$f":"B30-B31","v":0},null,null,2.6100000000000012,{"$f":"cubspline(3,F30,Data!$B$36:$B$56,Data!$A$36:$A$56)","v":0},1E-10,2.6100000000000012,2.6100000000000012]
[7.4999999999999997E-2,{"$f":"IF(cubspline(3,A31,Data!$A$36:$A$56,Data!$B$36:$B$56)<100,(cubspline(3,A31,Data!$A$36:$A$56,Data!$B$36:$B$56)),100)","v":0},{"$f":"B31","v":0},null,null,2.7100000000000013,{"$f":"cubspline(3,F31,Data!$B$36:$B$56,Data!$A$36:$A$56)","v":0},1E-10,2.7100000000000013,2.7100000000000013]
[19,{"$f":"IF(cubspline(3,A32,Data!$A$36:$A$56,Data!$B$36:$B$56)<100,(cubspline(3,A32,Data!$A$36:$A$56,Data!$B$36:$B$56)),100)","v":0},{"$f":"100-B32","v":100},null,null,2.8100000000000014,{"$f":"cubspline(3,F32,Data!$B$36:$B$56,Data!$A$36:$A$56)","v":0},1E-10,2.8100000000000014,2.8100000000000014]
[null,null,null,null,null,2.9100000000000015,{"$f":"cubspline(3,F33,Data!$B$36:$B$56,Data!$A$36:$A$56)","v":0},1E-10,2.9100000000000015,2.9100000000000015]
[null,null,null,null,null,3.0100000000000016,{"$f":"cubspline(3,F34,Data!$B$36:$B$56,Data!$A$36:$A$56)","v":0},1E-10,3.0100000000000016,3.0100000000000016]
["Size","Passing",null,null,null,3.1100000000000017,{"$f":"cubspline(3,F35,Data!$B$36:$B$56,Data!$A$36:$A$56)","v":0},1E-10,3.1100000000000017,3.1100000000000017]
[0,0,null,null,null,3.2100000000000017,{"$f":"cubspline(3,F36,Data!$B$36:$B$56,Data!$A$36:$A$56)","v":0},1E-10,3.2100000000000017,3.2100000000000017]
[{"$f":"Input!K24","v":0},{"$f":"Input!L24","v":0},{"$f":"IF(A37=0,\"na\",A37)","v":"na"},null,null,3.3100000000000018,{"$f":"cubspline(3,F37,Data!$B$36:$B$56,Data!$A$36:$A$56)","v":0},1E-10,3.3100000000000018,3.3100000000000018]
[{"$f":"Input!K23","v":0},{"$f":"Input!L23","v":0},{"$f":"IF(A38=0,\"na\",A38)","v":"na"},null,null,3.4100000000000019,{"$f":"cubspline(3,F38,Data!$B$36:$B$56,Data!$A$36:$A$56)","v":0},1E-10,3.4100000000000019,3.4100000000000019]
[{"$f":"Input!K22","v":0},{"$f":"Input!L22","v":0},"na",null,null,3.510000000000002,{"$f":"cubspline(3,F39,Data!$B$36:$B$56,Data!$A$36:$A$56)","v":0},1E-10,3.510000000000002,3.510000000000002]
[{"$f":"Input!K21","v":0},{"$f":"Input!L21","v":0},"na",null,null,3.6100000000000021,{"$f":"cubspline(3,F40,Data!$B$36:$B$56,Data!$A$36:$A$56)","v":0},1E-10,3.6100000000000021,3.6100000000000021]
[{"$f":"Input!K20","v":0},{"$f":"Input!L20","v":0},"na",null,null,3.7100000000000022,{"$f":"cubspline(3,F41,Data!$B$36:$B$56,Data!$A$36:$A$56)","v":0},1E-10,3.7100000000000022,3.7100000000000022]
[{"$f":"Input!K19","v":0},{"$f":"Input!L19","v":0},"na",null,null,3.8100000000000023,{"$f":"cubspline(3,F42,Data!$B$36:$B$56,Data!$A$36:$A$56)","v":0},1E-10,3.8100000000000023,3.8100000000000023]
[{"$f":"Input!K18","v":0},{"$f":"Input!L18","v":0},"na",null,null,3.9100000000000024,{"$f":"cubspline(3,F43,Data!$B$36:$B$56,Data!$A$36:$A$56)","v":0},1E-10,3.9100000000000024,3.9100000000000024]
[{"$f":"Input!K17","v":0},{"$f":"Input!L17","v":0},"na",{"$f":"MIN(C37:C56)","v":0},"Min Sieve Used",4.0100000000000025,{"$f":"cubspline(3,F44,Data!$B$36:$B$56,Data!$A$36:$A$56)","v":0},1E-10,4.0100000000000025,4.0100000000000025]
[{"$f":"Input!K16","v":0},{"$f":"Input!L16","v":0},"na"," ",null,4.1100000000000021,{"$f":"cubspline(3,F45,Data!$B$36:$B$56,Data!$A$36:$A$56)","v":0},1E-10,4.1100000000000021,4.1100000000000021]
[{"$f":"Input!K15","v":0},{"$f":"Input!L15","v":0},"na",null,null,4.2100000000000017,{"$f":"cubspline(3,F46,Data!$B$36:$B$56,Data!$A$36:$A$56)","v":0},1E-10,4.2100000000000017,4.2100000000000017]
[{"$f":"Input!K14","v":0},{"$f":"Input!L14","v":0},"na",{"$f":"IF(cubspline(3,D44,Data!$A$36:$A$56,Data!$B$36:$B$56)<100,(cubspline(3,D44,Data!$A$36:$A$56,Data!$B$36:$B$56)),100)","v":0},"% Passing Min Sieve",4.3100000000000014,{"$f":"cubspline(3,F47,Data!$B$36:$B$56,Data!$A$36:$A$56)","v":0},1E-10,4.3100000000000014,4.3100000000000014]
[{"$f":"Input!K13","v":0},{"$f":"Input!L13","v":0},"na",null,null,4.410000000000001,{"$f":"cubspline(3,F48,Data!$B$36:$B$56,Data!$A$36:$A$56)","v":0},1E-10,4.410000000000001,4.410000000000001]
[{"$f":"Input!K12","v":0},{"$f":"Input!L12","v":0},"na",null,null,4.5100000000000007,{"$f":"cubspline(3,F49,Data!$B$36:$B$56,Data!$A$36:$A$56)","v":0},1E-10,4.5100000000000007,4.5100000000000007]
[{"$f":"Input!K11","v":0},{"$f":"Input!L11","v":0},"na",null," ",4.6100000000000003,{"$f":"cubspline(3,F50,Data!$B$36:$B$56,Data!$A$36:$A$56)","v":0},1E-10,4.6100000000000003,4.6100000000000003]
[{"$f":"Input!K10","v":0},{"$f":"Input!L10","v":0},"na",null,null,4.71,{"$f":"cubspline(3,F51,Data!$B$36:$B$56,Data!$A$36:$A$56)","v":0},1E-10,4.71,4.71]
[{"$f":"Input!K9","v":0},{"$f":"Input!L9","v":0},"na",null,null,4.8099999999999996,{"$f":"cubspline(3,F52,Data!$B$36:$B$56,Data!$A$36:$A$56)","v":0},1E-10,4.8099999999999996,4.8099999999999996]
[{"$f":"Input!K8","v":0},{"$f":"Input!L8","v":0},"na",null,null,4.9099999999999993,{"$f":"cubspline(3,F53,Data!$B$36:$B$56,Data!$A$36:$A$56)","v":0},1E-10,4.9099999999999993,4.9099999999999993]
[{"$f":"Input!K7","v":0},{"$f":"Input!L7","v":0},"na",null,null,5.0099999999999989,{"$f":"cubspline(3,F54,Data!$B$36:$B$56,Data!$A$36:$A$56)","v":0},1E-10,5.0099999999999989,5.0099999999999989]
[{"$f":"Input!K6","v":0},{"$f":"Input!L6","v":0},"na",null,null,5.1099999999999985,{"$f":"cubspline(3,F55,Data!$B$36:$B$56,Data!$A$36:$A$56)","v":0},1E-10,5.1099999999999985,5.1099999999999985]
[{"$f":"Input!K5","v":0},{"$f":"Input!L5","v":0},"na",null,null,5.2099999999999982,{"$f":"cubspline(3,F56,Data!$B$36:$B$56,Data!$A$36:$A$56)","v":0},1E-10,5.2099999999999982,5.2099999999999982]
[null,null,null,null,null,5.3099999999999978,{"$f":"cubspline(3,F57,Data!$B$36:$B$56,Data!$A$36:$A$56)","v":0},1E-10,5.3099999999999978,5.3099999999999978]
[null,null,"Identifies min sieve",null,null,5.4099999999999975,{"$f":"cubspline(3,F58,Data!$B$36:$B$56,Data!$A$36:$A$56)","v":0},1E-10,5.4099999999999975,5.4099999999999975]
[null,null,"size used for plot of curve fit",null,null,5.5099999999999971,{"$f":"cubspline(3,F59,Data!$B$36:$B$56,Data!$A$36:$A$56)","v":0},1E-10,5.5099999999999971,5.5099999999999971]
[null,null,null,null,null,5.6099999999999968,{"$f":"cubspline(3,F60,Data!$B$36:$B$56,Data!$A$36:$A$56)","v":0},1E-10,5.6099999999999968,5.6099999999999968]
[null,null,null,null,null,5.7099999999999964,{"$f":"cubspline(3,F61,Data!$B$36:$B$56,Data!$A$36:$A$56)","v":0},1E-10,5.7099999999999964,5.7099999999999964]
["Plots for sand, gravel,fines",null,null,null,null,5.8099999999999961,{"$f":"cubspline(3,F62,Data!$B$36:$B$56,Data!$A$36:$A$56)","v":0},1E-10,5.8099999999999961,5.8099999999999961]
[75,1.0000000000000001E-5,null,null,null,5.9099999999999957,{"$f":"cubspline(3,F63,Data!$B$36:$B$56,Data!$A$36:$A$56)","v":0},1E-10,5.9099999999999957,5.9099999999999957]
[75,100,null,null,null,6.0099999999999953,{"$f":"cubspline(3,F64,Data!$B$36:$B$56,Data!$A$36:$A$56)","v":0},1E-10,6.0099999999999953,6.0099999999999953]
[null,null,null,null,null,6.109999999999995,{"$f":"cubspline(3,F65,Data!$B$36:$B$56,Data!$A$36:$A$56)","v":0},1E-10,6.109999999999995,6.109999999999995]
[4.75,9.9999999999999995E-7,null,null,null,6.2099999999999946,{"$f":"cubspline(3,F66,Data!$B$36:$B$56,Data!$A$36:$A$56)","v":0},1E-10,6.2099999999999946,6.2099999999999946]
[4.75,100,null,null,null,6.3099999999999943,{"$f":"cubspline(3,F67,Data!$B$36:$B$56,Data!$A$36:$A$56)","v":0},1E-10,6.3099999999999943,6.3099999999999943]
[null,null,null,null,null,6.4099999999999939,{"$f":"cubspline(3,F68,Data!$B$36:$B$56,Data!$A$36:$A$56)","v":0},1E-10,6.4099999999999939,6.4099999999999939]
[7.4999999999999997E-2,9.9999999999999995E-7,null,null,null,6.5099999999999936,{"$f":"cubspline(3,F69,Data!$B$36:$B$56,Data!$A$36:$A$56)","v":0},1E-10,{"$f":"IF(F69>$D$47,F69,NA())","v":6.5099999999999936},{"$f":"IF(F69>=$D$47,F69,($D$47-(0.3*($D$47-F69))))","v":6.5099999999999936}]
[7.4999999999999997E-2,100,null,null,null,{"$f":"F69+0.1","v":6.6099999999999932},{"$f":"cubspline(3,F70,Data!$B$36:$B$56,Data!$A$36:$A$56)","v":0},{"$f":"IF(G70<=0,0.0000000001,G70)","v":1E-10},6.6099999999999932,6.6099999999999932]
[null,null,null,null,null,6.7099999999999929,{"$f":"cubspline(3,F71,Data!$B$36:$B$56,Data!$A$36:$A$56)","v":0},1E-10,6.7099999999999929,6.7099999999999929]
[null,null,null,null,null,6.8099999999999925,{"$f":"cubspline(3,F72,Data!$B$36:$B$56,Data!$A$36:$A$56)","v":0},1E-10,6.8099999999999925,6.8099999999999925]
[null,null,null,null,null,6.9099999999999921,{"$f":"cubspline(3,F73,Data!$B$36:$B$56,Data!$A$36:$A$56)","v":0},1E-10,6.9099999999999921,6.9099999999999921]
[null,null,null,null,null,7.0099999999999918,{"$f":"cubspline(3,F74,Data!$B$36:$B$56,Data!$A$36:$A$56)","v":0},1E-10,7.0099999999999918,7.0099999999999918]
[null,null,null,null,null,7.1099999999999914,{"$f":"cubspline(3,F75,Data!$B$36:$B$56,Data!$A$36:$A$56)","v":0},1E-10,7.1099999999999914,7.1099999999999914]
[null,null,null,null,null,7.2099999999999911,{"$f":"cubspline(3,F76,Data!$B$36:$B$56,Data!$A$36:$A$56)","v":0},1E-10,7.2099999999999911,7.2099999999999911]
[null,null,null,null,null,7.3099999999999907,{"$f":"cubspline(3,F77,Data!$B$36:$B$56,Data!$A$36:$A$56)","v":0},1E-10,7.3099999999999907,7.3099999999999907]
[null,null,null,null,null,7.4099999999999904,{"$f":"cubspline(3,F78,Data!$B$36:$B$56,Data!$A$36:$A$56)","v":0},1E-10,7.4099999999999904,7.4099999999999904]
[null,null,null,null,null,7.50999999999999,{"$f":"cubspline(3,F79,Data!$B$36:$B$56,Data!$A$36:$A$56)","v":0},1E-10,7.50999999999999,7.50999999999999]
[null,null,null,null,null,7.6099999999999897,{"$f":"cubspline(3,F80,Data!$B$36:$B$56,Data!$A$36:$A$56)","v":0},1E-10,7.6099999999999897,7.6099999999999897]
[null,null,null,null,null,7.7099999999999893,{"$f":"cubspline(3,F81,Data!$B$36:$B$56,Data!$A$36:$A$56)","v":0},1E-10,7.7099999999999893,7.7099999999999893]
[null,null,null,null,null,7.809999999999989,{"$f":"cubspline(3,F82,Data!$B$36:$B$56,Data!$A$36:$A$56)","v":0},1E-10,7.809999999999989,7.809999999999989]
[null,null,null,null,null,7.9099999999999886,{"$f":"cubspline(3,F83,Data!$B$36:$B$56,Data!$A$36:$A$56)","v":0},1E-10,7.9099999999999886,7.9099999999999886]
[null,null,null,null,null,8.0099999999999891,{"$f":"cubspline(3,F84,Data!$B$36:$B$56,Data!$A$36:$A$56)","v":0},1E-10,8.0099999999999891,8.0099999999999891]
[null,null,null,null,null,8.1099999999999888,{"$f":"cubspline(3,F85,Data!$B$36:$B$56,Data!$A$36:$A$56)","v":0},1E-10,8.1099999999999888,8.1099999999999888]
[null,null,null,null,null,8.2099999999999884,{"$f":"cubspline(3,F86,Data!$B$36:$B$56,Data!$A$36:$A$56)","v":0},1E-10,8.2099999999999884,8.2099999999999884]
[null,null,null,null,null,8.3099999999999881,{"$f":"cubspline(3,F87,Data!$B$36:$B$56,Data!$A$36:$A$56)","v":0},1E-10,8.3099999999999881,8.3099999999999881]
[null,null,null,null,null,8.4099999999999877,{"$f":"cubspline(3,F88,Data!$B$36:$B$56,Data!$A$36:$A$56)","v":0},1E-10,8.4099999999999877,8.4099999999999877]
[null,null,null,null,null,8.5099999999999874,{"$f":"cubspline(3,F89,Data!$B$36:$B$56,Data!$A$36:$A$56)","v":0},1E-10,8.5099999999999874,8.5099999999999874]
[null,null,null,null,null,8.609999999999987,{"$f":"cubspline(3,F90,Data!$B$36:$B$56,Data!$A$36:$A$56)","v":0},1E-10,8.609999999999987,8.609999999999987]
[null,null,null,null,null,8.7099999999999866,{"$f":"cubspline(3,F91,Data!$B$36:$B$56,Data!$A$36:$A$56)","v":0},1E-10,8.7099999999999866,8.7099999999999866]
[null,null,null,null,null,8.8099999999999863,{"$f":"cubspline(3,F92,Data!$B$36:$B$56,Data!$A$36:$A$56)","v":0},1E-10,8.8099999999999863,8.8099999999999863]
[null,null,null,null,null,8.9099999999999859,{"$f":"cubspline(3,F93,Data!$B$36:$B$56,Data!$A$36:$A$56)","v":0},1E-10,8.9099999999999859,8.9099999999999859]
[null,null,null,null,null,9.0099999999999856,{"$f":"cubspline(3,F94,Data!$B$36:$B$56,Data!$A$36:$A$56)","v":0},1E-10,9.0099999999999856,9.0099999999999856]
[null,null,null,null,null,9.1099999999999852,{"$f":"cubspline(3,F95,Data!$B$36:$B$56,Data!$A$36:$A$56)","v":0},1E-10,9.1099999999999852,9.1099999999999852]
[null,null,null,null,null,9.2099999999999849,{"$f":"cubspline(3,F96,Data!$B$36:$B$56,Data!$A$36:$A$56)","v":0},1E-10,9.2099999999999849,9.2099999999999849]
[null,null,null,null,null,9.3099999999999845,{"$f":"cubspline(3,F97,Data!$B$36:$B$56,Data!$A$36:$A$56)","v":0},1E-10,9.3099999999999845,9.3099999999999845]
[null,null,null,null,null,9.4099999999999842,{"$f":"cubspline(3,F98,Data!$B$36:$B$56,Data!$A$36:$A$56)","v":0},1E-10,9.4099999999999842,9.4099999999999842]
[null,null,null,null,null,9.5099999999999838,{"$f":"cubspline(3,F99,Data!$B$36:$B$56,Data!$A$36:$A$56)","v":0},1E-10,9.5099999999999838,9.5099999999999838]
[null,null,null,null,null,9.6099999999999834,{"$f":"cubspline(3,F100,Data!$B$36:$B$56,Data!$A$36:$A$56)","v":0},1E-10,9.6099999999999834,9.6099999999999834]
[null,null,null,null,null,9.7099999999999831,{"$f":"cubspline(3,F101,Data!$B$36:$B$56,Data!$A$36:$A$56)","v":0},1E-10,9.7099999999999831,9.7099999999999831]
[null,null,null,null,null,9.8099999999999827,{"$f":"cubspline(3,F102,Data!$B$36:$B$56,Data!$A$36:$A$56)","v":0},1E-10,9.8099999999999827,9.8099999999999827]
[null,null,null,null,null,9.9099999999999824,{"$f":"cubspline(3,F103,Data!$B$36:$B$56,Data!$A$36:$A$56)","v":0},1E-10,9.9099999999999824,9.9099999999999824]
[null,null,null,null,null,10.009999999999982,{"$f":"cubspline(3,F104,Data!$B$36:$B$56,Data!$A$36:$A$56)","v":0},1E-10,10.009999999999982,10.009999999999982]
[null,null,null,null,null,10.109999999999982,{"$f":"cubspline(3,F105,Data!$B$36:$B$56,Data!$A$36:$A$56)","v":0},1E-10,10.109999999999982,10.109999999999982]
[null,null,null,null,null,10.209999999999981,{"$f":"cubspline(3,F106,Data!$B$36:$B$56,Data!$A$36:$A$56)","v":0},1E-10,10.209999999999981,10.209999999999981]
[null,null,null,null,null,10.309999999999981,{"$f":"cubspline(3,F107,Data!$B$36:$B$56,Data!$A$36:$A$56)","v":0},1E-10,10.309999999999981,10.309999999999981]
[null,null,null,null,null,10.409999999999981,{"$f":"cubspline(3,F108,Data!$B$36:$B$56,Data!$A$36:$A$56)","v":0},1E-10,10.409999999999981,10.409999999999981]
[null,null,null,null,null,10.50999999999998,{"$f":"cubspline(3,F109,Data!$B$36:$B$56,Data!$A$36:$A$56)","v":0},1E-10,10.50999999999998,10.50999999999998]
[null,null,null,null,null,10.60999999999998,{"$f":"cubspline(3,F110,Data!$B$36:$B$56,Data!$A$36:$A$56)","v":0},1E-10,10.60999999999998,10.60999999999998]
[null,null,null,null,null,10.70999999999998,{"$f":"cubspline(3,F111,Data!$B$36:$B$56,Data!$A$36:$A$56)","v":0},1E-10,10.70999999999998,10.70999999999998]
[null,null,null,null,null,10.809999999999979,{"$f":"cubspline(3,F112,Data!$B$36:$B$56,Data!$A$36:$A$56)","v":0},1E-10,10.809999999999979,10.809999999999979]
[null,null,null,null,null,10.909999999999979,{"$f":"cubspline(3,F113,Data!$B$36:$B$56,Data!$A$36:$A$56)","v":0},1E-10,10.909999999999979,10.909999999999979]
[null,null,null,null,null,11.009999999999978,{"$f":"cubspline(3,F114,Data!$B$36:$B$56,Data!$A$36:$A$56)","v":0},1E-10,11.009999999999978,11.009999999999978]
[null,null,null,null,null,11.109999999999978,{"$f":"cubspline(3,F115,Data!$B$36:$B$56,Data!$A$36:$A$56)","v":0},1E-10,11.109999999999978,11.109999999999978]
[null,null,null,null,null,11.209999999999978,{"$f":"cubspline(3,F116,Data!$B$36:$B$56,Data!$A$36:$A$56)","v":0},1E-10,11.209999999999978,11.209999999999978]
[null,null,null,null,null,11.309999999999977,{"$f":"cubspline(3,F117,Data!$B$36:$B$56,Data!$A$36:$A$56)","v":0},1E-10,11.309999999999977,11.309999999999977]
[null,null,null,null,null,11.409999999999977,{"$f":"cubspline(3,F118,Data!$B$36:$B$56,Data!$A$36:$A$56)","v":0},1E-10,11.409999999999977,11.409999999999977]
[null,null,null,null,null,11.509999999999977,{"$f":"cubspline(3,F119,Data!$B$36:$B$56,Data!$A$36:$A$56)","v":0},1E-10,11.509999999999977,11.509999999999977]
[null,null,null,null,null,11.609999999999976,{"$f":"cubspline(3,F120,Data!$B$36:$B$56,Data!$A$36:$A$56)","v":0},1E-10,11.609999999999976,11.609999999999976]
[null,null,null,null,null,11.709999999999976,{"$f":"cubspline(3,F121,Data!$B$36:$B$56,Data!$A$36:$A$56)","v":0},1E-10,11.709999999999976,11.709999999999976]
[null,null,null,null,null,11.809999999999976,{"$f":"cubspline(3,F122,Data!$B$36:$B$56,Data!$A$36:$A$56)","v":0},1E-10,11.809999999999976,11.809999999999976]
[null,null,null,null,null,11.909999999999975,{"$f":"cubspline(3,F123,Data!$B$36:$B$56,Data!$A$36:$A$56)","v":0},1E-10,11.909999999999975,11.909999999999975]
[null,null,null,null,null,12.009999999999975,{"$f":"cubspline(3,F124,Data!$B$36:$B$56,Data!$A$36:$A$56)","v":0},1E-10,12.009999999999975,12.009999999999975]
[null,null,null,null,null,12.109999999999975,{"$f":"cubspline(3,F125,Data!$B$36:$B$56,Data!$A$36:$A$56)","v":0},1E-10,12.109999999999975,12.109999999999975]
[null,null,null,null,null,12.209999999999974,{"$f":"cubspline(3,F126,Data!$B$36:$B$56,Data!$A$36:$A$56)","v":0},1E-10,12.209999999999974,12.209999999999974]
[null,null,null,null,null,12.309999999999974,{"$f":"cubspline(3,F127,Data!$B$36:$B$56,Data!$A$36:$A$56)","v":0},1E-10,12.309999999999974,12.309999999999974]
[null,null,null,null,null,12.409999999999973,{"$f":"cubspline(3,F128,Data!$B$36:$B$56,Data!$A$36:$A$56)","v":0},1E-10,12.409999999999973,12.409999999999973]
[null,null,null,null,null,12.509999999999973,{"$f":"cubspline(3,F129,Data!$B$36:$B$56,Data!$A$36:$A$56)","v":0},1E-10,12.509999999999973,12.509999999999973]
[null,null,null,null,null,12.609999999999973,{"$f":"cubspline(3,F130,Data!$B$36:$B$56,Data!$A$36:$A$56)","v":0},1E-10,12.609999999999973,12.609999999999973]
[null,null,null,null,null,12.709999999999972,{"$f":"cubspline(3,F131,Data!$B$36:$B$56,Data!$A$36:$A$56)","v":0},1E-10,12.709999999999972,12.709999999999972]
[null,null,null,null,null,12.809999999999972,{"$f":"cubspline(3,F132,Data!$B$36:$B$56,Data!$A$36:$A$56)","v":0},1E-10,12.809999999999972,12.809999999999972]
[null,null,null,null,null,12.909999999999972,{"$f":"cubspline(3,F133,Data!$B$36:$B$56,Data!$A$36:$A$56)","v":0},1E-10,{"$f":"IF(F133>$D$47,F133,NA())","v":12.909999999999972},{"$f":"IF(F133>=$D$47,F133,($D$47-(0.3*($D$47-F133))))","v":12.909999999999972}]
[null,null,null,null,null,{"$f":"F133+0.1","v":13.009999999999971},{"$f":"cubspline(3,F134,Data!$B$36:$B$56,Data!$A$36:$A$56)","v":0},{"$f":"IF(G134<=0,0.0000000001,G134)","v":1E-10},13.009999999999971,13.009999999999971]
[null,null,null,null,null,13.109999999999971,{"$f":"cubspline(3,F135,Data!$B$36:$B$56,Data!$A$36:$A$56)","v":0},1E-10,13.109999999999971,13.109999999999971]
[null,null,null,null,null,13.209999999999971,{"$f":"cubspline(3,F136,Data!$B$36:$B$56,Data!$A$36:$A$56)","v":0},1E-10,13.209999999999971,13.209999999999971]
[null,null,null,null,null,13.30999999999997,{"$f":"cubspline(3,F137,Data!$B$36:$B$56,Data!$A$36:$A$56)","v":0},1E-10,13.30999999999997,13.30999999999997]
[null,null,null,null,null,13.40999999999997,{"$f":"cubspline(3,F138,Data!$B$36:$B$56,Data!$A$36:$A$56)","v":0},1E-10,13.40999999999997,13.40999999999997]
[null,null,null,null,null,13.50999999999997,{"$f":"cubspline(3,F139,Data!$B$36:$B$56,Data!$A$36:$A$56)","v":0},1E-10,13.50999999999997,13.50999999999997]
[null,null,null,null,null,13.609999999999969,{"$f":"cubspline(3,F140,Data!$B$36:$B$56,Data!$A$36:$A$56)","v":0},1E-10,13.609999999999969,13.609999999999969]
[null,null,null,null,null,13.709999999999969,{"$f":"cubspline(3,F141,Data!$B$36:$B$56,Data!$A$36:$A$56)","v":0},1E-10,13.709999999999969,13.709999999999969]
[null,null,null,null,null,13.809999999999969,{"$f":"cubspline(3,F142,Data!$B$36:$B$56,Data!$A$36:$A$56)","v":0},1E-10,13.809999999999969,13.809999999999969]
[null,null,null,null,null,13.909999999999968,{"$f":"cubspline(3,F143,Data!$B$36:$B$56,Data!$A$36:$A$56)","v":0},1E-10,13.909999999999968,13.909999999999968]
[null,null,null,null,null,14.009999999999968,{"$f":"cubspline(3,F144,Data!$B$36:$B$56,Data!$A$36:$A$56)","v":0},1E-10,14.009999999999968,14.009999999999968]
[null,null,null,null,null,14.109999999999967,{"$f":"cubspline(3,F145,Data!$B$36:$B$56,Data!$A$36:$A$56)","v":0},1E-10,14.109999999999967,14.109999999999967]
[null,null,null,null,null,14.209999999999967,{"$f":"cubspline(3,F146,Data!$B$36:$B$56,Data!$A$36:$A$56)","v":0},1E-10,14.209999999999967,14.209999999999967]
[null,null,null,null,null,14.309999999999967,{"$f":"cubspline(3,F147,Data!$B$36:$B$56,Data!$A$36:$A$56)","v":0},1E-10,14.309999999999967,14.309999999999967]
[null,null,null,null,null,14.409999999999966,{"$f":"cubspline(3,F148,Data!$B$36:$B$56,Data!$A$36:$A$56)","v":0},1E-10,14.409999999999966,14.409999999999966]
[null,null,null,null,null,14.509999999999966,{"$f":"cubspline(3,F149,Data!$B$36:$B$56,Data!$A$36:$A$56)","v":0},1E-10,14.509999999999966,14.509999999999966]
[null,null,null,null,null,14.609999999999966,{"$f":"cubspline(3,F150,Data!$B$36:$B$56,Data!$A$36:$A$56)","v":0},1E-10,14.609999999999966,14.609999999999966]
[null,null,null,null,null,14.709999999999965,{"$f":"cubspline(3,F151,Data!$B$36:$B$56,Data!$A$36:$A$56)","v":0},1E-10,14.709999999999965,14.709999999999965]
[null,null,null,null,null,14.809999999999965,{"$f":"cubspline(3,F152,Data!$B$36:$B$56,Data!$A$36:$A$56)","v":0},1E-10,14.809999999999965,14.809999999999965]
[null,null,null,null,null,14.909999999999965,{"$f":"cubspline(3,F153,Data!$B$36:$B$56,Data!$A$36:$A$56)","v":0},1E-10,14.909999999999965,14.909999999999965]
[null,null,null,null,null,15.009999999999964,{"$f":"cubspline(3,F154,Data!$B$36:$B$56,Data!$A$36:$A$56)","v":0},1E-10,15.009999999999964,15.009999999999964]
[null,null,null,null,null,15.109999999999964,{"$f":"cubspline(3,F155,Data!$B$36:$B$56,Data!$A$36:$A$56)","v":0},1E-10,15.109999999999964,15.109999999999964]
[null,null,null,null,null,15.209999999999964,{"$f":"cubspline(3,F156,Data!$B$36:$B$56,Data!$A$36:$A$56)","v":0},1E-10,15.209999999999964,15.209999999999964]
[null,null,null,null,null,15.309999999999963,{"$f":"cubspline(3,F157,Data!$B$36:$B$56,Data!$A$36:$A$56)","v":0},1E-10,15.309999999999963,15.309999999999963]
[null,null,null,null,null,15.409999999999963,{"$f":"cubspline(3,F158,Data!$B$36:$B$56,Data!$A$36:$A$56)","v":0},1E-10,15.409999999999963,15.409999999999963]
[null,null,null,null,null,15.509999999999962,{"$f":"cubspline(3,F159,Data!$B$36:$B$56,Data!$A$36:$A$56)","v":0},1E-10,15.509999999999962,15.509999999999962]
[null,null,null,null,null,15.609999999999962,{"$f":"cubspline(3,F160,Data!$B$36:$B$56,Data!$A$36:$A$56)","v":0},1E-10,15.609999999999962,15.609999999999962]
[null,null,null,null,null,15.709999999999962,{"$f":"cubspline(3,F161,Data!$B$36:$B$56,Data!$A$36:$A$56)","v":0},1E-10,15.709999999999962,15.709999999999962]
[null,null,null,null,null,15.809999999999961,{"$f":"cubspline(3,F162,Data!$B$36:$B$56,Data!$A$36:$A$56)","v":0},1E-10,15.809999999999961,15.809999999999961]
[null,null,null,null,null,15.909999999999961,{"$f":"cubspline(3,F163,Data!$B$36:$B$56,Data!$A$36:$A$56)","v":0},1E-10,15.909999999999961,15.909999999999961]
[null,null,null,null,null,16.009999999999962,{"$f":"cubspline(3,F164,Data!$B$36:$B$56,Data!$A$36:$A$56)","v":0},1E-10,16.009999999999962,16.009999999999962]
[null,null,null,null,null,16.109999999999964,{"$f":"cubspline(3,F165,Data!$B$36:$B$56,Data!$A$36:$A$56)","v":0},1E-10,16.109999999999964,16.109999999999964]
[null,null,null,null,null,16.209999999999965,{"$f":"cubspline(3,F166,Data!$B$36:$B$56,Data!$A$36:$A$56)","v":0},1E-10,16.209999999999965,16.209999999999965]
[null,null,null,null,null,16.309999999999967,{"$f":"cubspline(3,F167,Data!$B$36:$B$56,Data!$A$36:$A$56)","v":0},1E-10,16.309999999999967,16.309999999999967]
[null,null,null,null,null,16.409999999999968,{"$f":"cubspline(3,F168,Data!$B$36:$B$56,Data!$A$36:$A$56)","v":0},1E-10,16.409999999999968,16.409999999999968]
[null,null,null,null,null,16.50999999999997,{"$f":"cubspline(3,F169,Data!$B$36:$B$56,Data!$A$36:$A$56)","v":0},1E-10,16.50999999999997,16.50999999999997]
[null,null,null,null,null,16.609999999999971,{"$f":"cubspline(3,F170,Data!$B$36:$B$56,Data!$A$36:$A$56)","v":0},1E-10,16.609999999999971,16.609999999999971]
[null,null,null,null,null,16.709999999999972,{"$f":"cubspline(3,F171,Data!$B$36:$B$56,Data!$A$36:$A$56)","v":0},1E-10,16.709999999999972,16.709999999999972]
[null,null,null,null,null,16.809999999999974,{"$f":"cubspline(3,F172,Data!$B$36:$B$56,Data!$A$36:$A$56)","v":0},1E-10,16.809999999999974,16.809999999999974]
[null,null,null,null,null,16.909999999999975,{"$f":"cubspline(3,F173,Data!$B$36:$B$56,Data!$A$36:$A$56)","v":0},1E-10,16.909999999999975,16.909999999999975]
[null,null,null,null,null,17.009999999999977,{"$f":"cubspline(3,F174,Data!$B$36:$B$56,Data!$A$36:$A$56)","v":0},1E-10,17.009999999999977,17.009999999999977]
[null,null,null,null,null,17.109999999999978,{"$f":"cubspline(3,F175,Data!$B$36:$B$56,Data!$A$36:$A$56)","v":0},1E-10,17.109999999999978,17.109999999999978]
[null,null,null,null,null,17.20999999999998,{"$f":"cubspline(3,F176,Data!$B$36:$B$56,Data!$A$36:$A$56)","v":0},1E-10,17.20999999999998,17.20999999999998]
[null,null,null,null,null,17.309999999999981,{"$f":"cubspline(3,F177,Data!$B$36:$B$56,Data!$A$36:$A$56)","v":0},1E-10,17.309999999999981,17.309999999999981]
[null,null,null,null,null,17.409999999999982,{"$f":"cubspline(3,F178,Data!$B$36:$B$56,Data!$A$36:$A$56)","v":0},1E-10,17.409999999999982,17.409999999999982]
[null,null,null,null,null,17.509999999999984,{"$f":"cubspline(3,F179,Data!$B$36:$B$56,Data!$A$36:$A$56)","v":0},1E-10,17.509999999999984,17.509999999999984]
[null,null,null,null,null,17.609999999999985,{"$f":"cubspline(3,F180,Data!$B$36:$B$56,Data!$A$36:$A$56)","v":0},1E-10,17.609999999999985,17.609999999999985]
[null,null,null,null,null,17.709999999999987,{"$f":"cubspline(3,F181,Data!$B$36:$B$56,Data!$A$36:$A$56)","v":0},1E-10,17.709999999999987,17.709999999999987]
[null,null,null,null,null,17.809999999999988,{"$f":"cubspline(3,F182,Data!$B$36:$B$56,Data!$A$36:$A$56)","v":0},1E-10,17.809999999999988,17.809999999999988]
[null,null,null,null,null,17.909999999999989,{"$f":"cubspline(3,F183,Data!$B$36:$B$56,Data!$A$36:$A$56)","v":0},1E-10,17.909999999999989,17.909999999999989]
[null,null,null,null,null,18.009999999999991,{"$f":"cubspline(3,F184,Data!$B$36:$B$56,Data!$A$36:$A$56)","v":0},1E-10,18.009999999999991,18.009999999999991]
[null,null,null,null,null,18.109999999999992,{"$f":"cubspline(3,F185,Data!$B$36:$B$56,Data!$A$36:$A$56)","v":0},1E-10,18.109999999999992,18.109999999999992]
[null,null,null,null,null,18.209999999999994,{"$f":"cubspline(3,F186,Data!$B$36:$B$56,Data!$A$36:$A$56)","v":0},1E-10,18.209999999999994,18.209999999999994]
[null,null,null,null,null,18.309999999999995,{"$f":"cubspline(3,F187,Data!$B$36:$B$56,Data!$A$36:$A$56)","v":0},1E-10,18.309999999999995,18.309999999999995]
[null,null,null,null,null,18.409999999999997,{"$f":"cubspline(3,F188,Data!$B$36:$B$56,Data!$A$36:$A$56)","v":0},1E-10,18.409999999999997,18.409999999999997]
[null,null,null,null,null,18.509999999999998,{"$f":"cubspline(3,F189,Data!$B$36:$B$56,Data!$A$36:$A$56)","v":0},1E-10,18.509999999999998,18.509999999999998]
[null,null,null,null,null,18.61,{"$f":"cubspline(3,F190,Data!$B$36:$B$56,Data!$A$36:$A$56)","v":0},1E-10,18.61,18.61]
[null,null,null,null,null,18.71,{"$f":"cubspline(3,F191,Data!$B$36:$B$56,Data!$A$36:$A$56)","v":0},1E-10,18.71,18.71]
[null,null,null,null,null,18.810000000000002,{"$f":"cubspline(3,F192,Data!$B$36:$B$56,Data!$A$36:$A$56)","v":0},1E-10,18.810000000000002,18.810000000000002]
[null,null,null,null,null,18.910000000000004,{"$f":"cubspline(3,F193,Data!$B$36:$B$56,Data!$A$36:$A$56)","v":0},1E-10,18.910000000000004,18.910000000000004]
[null,null,null,null,null,19.010000000000005,{"$f":"cubspline(3,F194,Data!$B$36:$B$56,Data!$A$36:$A$56)","v":0},1E-10,19.010000000000005,19.010000000000005]
[null,null,null,null,null,19.110000000000007,{"$f":"cubspline(3,F195,Data!$B$36:$B$56,Data!$A$36:$A$56)","v":0},1E-10,19.110000000000007,19.110000000000007]
[null,null,null,null,null,19.210000000000008,{"$f":"cubspline(3,F196,Data!$B$36:$B$56,Data!$A$36:$A$56)","v":0},1E-10,19.210000000000008,19.210000000000008]
[null,null,null,null,null,19.310000000000009,{"$f":"cubspline(3,F197,Data!$B$36:$B$56,Data!$A$36:$A$56)","v":0},1E-10,{"$f":"IF(F197>$D$47,F197,NA())","v":19.310000000000009},{"$f":"IF(F197>=$D$47,F197,($D$47-(0.3*($D$47-F197))))","v":19.310000000000009}]
[null,null,null,null,null,{"$f":"F197+0.1","v":19.410000000000011},{"$f":"cubspline(3,F198,Data!$B$36:$B$56,Data!$A$36:$A$56)","v":0},{"$f":"IF(G198<=0,0.0000000001,G198)","v":1E-10},19.410000000000011,19.410000000000011]
[null,null,null,null,null,19.510000000000012,{"$f":"cubspline(3,F199,Data!$B$36:$B$56,Data!$A$36:$A$56)","v":0},1E-10,19.510000000000012,19.510000000000012]
[null,null,null,null,null,19.610000000000014,{"$f":"cubspline(3,F200,Data!$B$36:$B$56,Data!$A$36:$A$56)","v":0},1E-10,19.610000000000014,19.610000000000014]
[null,null,null,null,null,19.710000000000015,{"$f":"cubspline(3,F201,Data!$B$36:$B$56,Data!$A$36:$A$56)","v":0},1E-10,19.710000000000015,19.710000000000015]
[null,null,null,null,null,19.810000000000016,{"$f":"cubspline(3,F202,Data!$B$36:$B$56,Data!$A$36:$A$56)","v":0},1E-10,19.810000000000016,19.810000000000016]
[null,null,null,null,null,19.910000000000018,{"$f":"cubspline(3,F203,Data!$B$36:$B$56,Data!$A$36:$A$56)","v":0},1E-10,19.910000000000018,19.910000000000018]
[null,null,null,null,null,20.010000000000019,{"$f":"cubspline(3,F204,Data!$B$36:$B$56,Data!$A$36:$A$56)","v":0},1E-10,20.010000000000019,20.010000000000019]
[null,null,null,null,null,20.110000000000021,{"$f":"cubspline(3,F205,Data!$B$36:$B$56,Data!$A$36:$A$56)","v":0},1E-10,20.110000000000021,20.110000000000021]
[null,null,null,null,null,20.210000000000022,{"$f":"cubspline(3,F206,Data!$B$36:$B$56,Data!$A$36:$A$56)","v":0},1E-10,20.210000000000022,20.210000000000022]
[null,null,null,null,null,20.310000000000024,{"$f":"cubspline(3,F207,Data!$B$36:$B$56,Data!$A$36:$A$56)","v":0},1E-10,20.310000000000024,20.310000000000024]
[null,null,null,null,null,20.410000000000025,{"$f":"cubspline(3,F208,Data!$B$36:$B$56,Data!$A$36:$A$56)","v":0},1E-10,20.410000000000025,20.410000000000025]
[null,null,null,null,null,20.510000000000026,{"$f":"cubspline(3,F209,Data!$B$36:$B$56,Data!$A$36:$A$56)","v":0},1E-10,20.510000000000026,20.510000000000026]
[null,null,null,null,null,20.610000000000028,{"$f":"cubspline(3,F210,Data!$B$36:$B$56,Data!$A$36:$A$56)","v":0},1E-10,20.610000000000028,20.610000000000028]
[null,null,null,null,null,20.710000000000029,{"$f":"cubspline(3,F211,Data!$B$36:$B$56,Data!$A$36:$A$56)","v":0},1E-10,20.710000000000029,20.710000000000029]
[null,null,null,null,null,20.810000000000031,{"$f":"cubspline(3,F212,Data!$B$36:$B$56,Data!$A$36:$A$56)","v":0},1E-10,20.810000000000031,20.810000000000031]
[null,null,null,null,null,20.910000000000032,{"$f":"cubspline(3,F213,Data!$B$36:$B$56,Data!$A$36:$A$56)","v":0},1E-10,20.910000000000032,20.910000000000032]
[null,null,null,null,null,21.010000000000034,{"$f":"cubspline(3,F214,Data!$B$36:$B$56,Data!$A$36:$A$56)","v":0},1E-10,21.010000000000034,21.010000000000034]
[null,null,null,null,null,21.110000000000035,{"$f":"cubspline(3,F215,Data!$B$36:$B$56,Data!$A$36:$A$56)","v":0},1E-10,21.110000000000035,21.110000000000035]
[null,null,null,null,null,21.210000000000036,{"$f":"cubspline(3,F216,Data!$B$36:$B$56,Data!$A$36:$A$56)","v":0},1E-10,21.210000000000036,21.210000000000036]
[null,null,null,null,null,21.310000000000038,{"$f":"cubspline(3,F217,Data!$B$36:$B$56,Data!$A$36:$A$56)","v":0},1E-10,21.310000000000038,21.310000000000038]
[null,null,null,null,null,21.410000000000039,{"$f":"cubspline(3,F218,Data!$B$36:$B$56,Data!$A$36:$A$56)","v":0},1E-10,21.410000000000039,21.410000000000039]
[null,null,null,null,null,21.510000000000041,{"$f":"cubspline(3,F219,Data!$B$36:$B$56,Data!$A$36:$A$56)","v":0},1E-10,21.510000000000041,21.510000000000041]
[null,null,null,null,null,21.610000000000042,{"$f":"cubspline(3,F220,Data!$B$36:$B$56,Data!$A$36:$A$56)","v":0},1E-10,21.610000000000042,21.610000000000042]
[null,null,null,null,null,21.710000000000043,{"$f":"cubspline(3,F221,Data!$B$36:$B$56,Data!$A$36:$A$56)","v":0},1E-10,21.710000000000043,21.710000000000043]
[null,null,null,null,null,21.810000000000045,{"$f":"cubspline(3,F222,Data!$B$36:$B$56,Data!$A$36:$A$56)","v":0},1E-10,21.810000000000045,21.810000000000045]
[null,null,null,null,null,21.910000000000046,{"$f":"cubspline(3,F223,Data!$B$36:$B$56,Data!$A$36:$A$56)","v":0},1E-10,21.910000000000046,21.910000000000046]
[null,null,null,null,null,22.010000000000048,{"$f":"cubspline(3,F224,Data!$B$36:$B$56,Data!$A$36:$A$56)","v":0},1E-10,22.010000000000048,22.010000000000048]
[null,null,null,null,null,22.110000000000049,{"$f":"cubspline(3,F225,Data!$B$36:$B$56,Data!$A$36:$A$56)","v":0},1E-10,22.110000000000049,22.110000000000049]
[null,null,null,null,null,22.210000000000051,{"$f":"cubspline(3,F226,Data!$B$36:$B$56,Data!$A$36:$A$56)","v":0},1E-10,22.210000000000051,22.210000000000051]
[null,null,null,null,null,22.310000000000052,{"$f":"cubspline(3,F227,Data!$B$36:$B$56,Data!$A$36:$A$56)","v":0},1E-10,22.310000000000052,22.310000000000052]
[null,null,null,null,null,22.410000000000053,{"$f":"cubspline(3,F228,Data!$B$36:$B$56,Data!$A$36:$A$56)","v":0},1E-10,22.410000000000053,22.410000000000053]
[null,null,null,null,null,22.510000000000055,{"$f":"cubspline(3,F229,Data!$B$36:$B$56,Data!$A$36:$A$56)","v":0},1E-10,22.510000000000055,22.510000000000055]
[null,null,null,null,null,22.610000000000056,{"$f":"cubspline(3,F230,Data!$B$36:$B$56,Data!$A$36:$A$56)","v":0},1E-10,22.610000000000056,22.610000000000056]
[null,null,null,null,null,22.710000000000058,{"$f":"cubspline(3,F231,Data!$B$36:$B$56,Data!$A$36:$A$56)","v":0},1E-10,22.710000000000058,22.710000000000058]
[null,null,null,null,null,22.810000000000059,{"$f":"cubspline(3,F232,Data!$B$36:$B$56,Data!$A$36:$A$56)","v":0},1E-10,22.810000000000059,22.810000000000059]
[null,null,null,null,null,22.910000000000061,{"$f":"cubspline(3,F233,Data!$B$36:$B$56,Data!$A$36:$A$56)","v":0},1E-10,22.910000000000061,22.910000000000061]
[null,null,null,null,null,23.010000000000062,{"$f":"cubspline(3,F234,Data!$B$36:$B$56,Data!$A$36:$A$56)","v":0},1E-10,23.010000000000062,23.010000000000062]
[null,null,null,null,null,23.110000000000063,{"$f":"cubspline(3,F235,Data!$B$36:$B$56,Data!$A$36:$A$56)","v":0},1E-10,23.110000000000063,23.110000000000063]
[null,null,null,null,null,23.210000000000065,{"$f":"cubspline(3,F236,Data!$B$36:$B$56,Data!$A$36:$A$56)","v":0},1E-10,23.210000000000065,23.210000000000065]
[null,null,null,null,null,23.310000000000066,{"$f":"cubspline(3,F237,Data!$B$36:$B$56,Data!$A$36:$A$56)","v":0},1E-10,23.310000000000066,23.310000000000066]
[null,null,null,null,null,23.410000000000068,{"$f":"cubspline(3,F238,Data!$B$36:$B$56,Data!$A$36:$A$56)","v":0},1E-10,23.410000000000068,23.410000000000068]
[null,null,null,null,null,23.510000000000069,{"$f":"cubspline(3,F239,Data!$B$36:$B$56,Data!$A$36:$A$56)","v":0},1E-10,23.510000000000069,23.510000000000069]
[null,null,null,null,null,23.61000000000007,{"$f":"cubspline(3,F240,Data!$B$36:$B$56,Data!$A$36:$A$56)","v":0},1E-10,23.61000000000007,23.61000000000007]
[null,null,null,null,null,23.710000000000072,{"$f":"cubspline(3,F241,Data!$B$36:$B$56,Data!$A$36:$A$56)","v":0},1E-10,23.710000000000072,23.710000000000072]
[null,null,null,null,null,23.810000000000073,{"$f":"cubspline(3,F242,Data!$B$36:$B$56,Data!$A$36:$A$56)","v":0},1E-10,23.810000000000073,23.810000000000073]
[null,null,null,null,null,23.910000000000075,{"$f":"cubspline(3,F243,Data!$B$36:$B$56,Data!$A$36:$A$56)","v":0},1E-10,23.910000000000075,23.910000000000075]
[null,null,null,null,null,24.010000000000076,{"$f":"cubspline(3,F244,Data!$B$36:$B$56,Data!$A$36:$A$56)","v":0},1E-10,24.010000000000076,24.010000000000076]
[null,null,null,null,null,24.110000000000078,{"$f":"cubspline(3,F245,Data!$B$36:$B$56,Data!$A$36:$A$56)","v":0},1E-10,24.110000000000078,24.110000000000078]
[null,null,null,null,null,24.210000000000079,{"$f":"cubspline(3,F246,Data!$B$36:$B$56,Data!$A$36:$A$56)","v":0},1E-10,24.210000000000079,24.210000000000079]
[null,null,null,null,null,24.31000000000008,{"$f":"cubspline(3,F247,Data!$B$36:$B$56,Data!$A$36:$A$56)","v":0},1E-10,24.31000000000008,24.31000000000008]
[null,null,null,null,null,24.410000000000082,{"$f":"cubspline(3,F248,Data!$B$36:$B$56,Data!$A$36:$A$56)","v":0},1E-10,24.410000000000082,24.410000000000082]
[null,null,null,null,null,24.510000000000083,{"$f":"cubspline(3,F249,Data!$B$36:$B$56,Data!$A$36:$A$56)","v":0},1E-10,24.510000000000083,24.510000000000083]
[null,null,null,null,null,24.610000000000085,{"$f":"cubspline(3,F250,Data!$B$36:$B$56,Data!$A$36:$A$56)","v":0},1E-10,24.610000000000085,24.610000000000085]
[null,null,null,null,null,24.710000000000086,{"$f":"cubspline(3,F251,Data!$B$36:$B$56,Data!$A$36:$A$56)","v":0},1E-10,24.710000000000086,24.710000000000086]
[null,null,null,null,null,24.810000000000088,{"$f":"cubspline(3,F252,Data!$B$36:$B$56,Data!$A$36:$A$56)","v":0},1E-10,24.810000000000088,24.810000000000088]
[null,null,null,null,null,24.910000000000089,{"$f":"cubspline(3,F253,Data!$B$36:$B$56,Data!$A$36:$A$56)","v":0},1E-10,24.910000000000089,24.910000000000089]
[null,null,null,null,null,25.01000000000009,{"$f":"cubspline(3,F254,Data!$B$36:$B$56,Data!$A$36:$A$56)","v":0},1E-10,25.01000000000009,25.01000000000009]
[null,null,null,null,null,25.110000000000092,{"$f":"cubspline(3,F255,Data!$B$36:$B$56,Data!$A$36:$A$56)","v":0},1E-10,25.110000000000092,25.110000000000092]
[null,null,null,null,null,25.210000000000093,{"$f":"cubspline(3,F256,Data!$B$36:$B$56,Data!$A$36:$A$56)","v":0},1E-10,25.210000000000093,25.210000000000093]
[null,null,null,null,null,25.310000000000095,{"$f":"cubspline(3,F257,Data!$B$36:$B$56,Data!$A$36:$A$56)","v":0},1E-10,25.310000000000095,25.310000000000095]
[null,null,null,null,null,25.410000000000096,{"$f":"cubspline(3,F258,Data!$B$36:$B$56,Data!$A$36:$A$56)","v":0},1E-10,25.410000000000096,25.410000000000096]
[null,null,null,null,null,25.510000000000097,{"$f":"cubspline(3,F259,Data!$B$36:$B$56,Data!$A$36:$A$56)","v":0},1E-10,25.510000000000097,25.510000000000097]
[null,null,null,null,null,25.610000000000099,{"$f":"cubspline(3,F260,Data!$B$36:$B$56,Data!$A$36:$A$56)","v":0},1E-10,25.610000000000099,25.610000000000099]
[null,null,null,null,null,25.7100000000001,{"$f":"cubspline(3,F261,Data!$B$36:$B$56,Data!$A$36:$A$56)","v":0},1E-10,{"$f":"IF(F261>$D$47,F261,NA())","v":25.7100000000001},{"$f":"IF(F261>=$D$47,F261,($D$47-(0.3*($D$47-F261))))","v":25.7100000000001}]
[null,null,null,null,null,{"$f":"F261+0.1","v":25.810000000000102},{"$f":"cubspline(3,F262,Data!$B$36:$B$56,Data!$A$36:$A$56)","v":0},{"$f":"IF(G262<=0,0.0000000001,G262)","v":1E-10},25.810000000000102,25.810000000000102]
[null,null,null,null,null,25.910000000000103,{"$f":"cubspline(3,F263,Data!$B$36:$B$56,Data!$A$36:$A$56)","v":0},1E-10,25.910000000000103,25.910000000000103]
[null,null,null,null,null,26.010000000000105,{"$f":"cubspline(3,F264,Data!$B$36:$B$56,Data!$A$36:$A$56)","v":0},1E-10,26.010000000000105,26.010000000000105]
[null,null,null,null,null,26.110000000000106,{"$f":"cubspline(3,F265,Data!$B$36:$B$56,Data!$A$36:$A$56)","v":0},1E-10,26.110000000000106,26.110000000000106]
[null,null,null,null,null,26.210000000000107,{"$f":"cubspline(3,F266,Data!$B$36:$B$56,Data!$A$36:$A$56)","v":0},1E-10,26.210000000000107,26.210000000000107]
[null,null,null,null,null,26.310000000000109,{"$f":"cubspline(3,F267,Data!$B$36:$B$56,Data!$A$36:$A$56)","v":0},1E-10,26.310000000000109,26.310000000000109]
[null,null,null,null,null,26.41000000000011,{"$f":"cubspline(3,F268,Data!$B$36:$B$56,Data!$A$36:$A$56)","v":0},1E-10,26.41000000000011,26.41000000000011]
[null,null,null,null,null,26.510000000000112,{"$f":"cubspline(3,F269,Data!$B$36:$B$56,Data!$A$36:$A$56)","v":0},1E-10,26.510000000000112,26.510000000000112]
[null,null,null,null,null,26.610000000000113,{"$f":"cubspline(3,F270,Data!$B$36:$B$56,Data!$A$36:$A$56)","v":0},1E-10,26.610000000000113,26.610000000000113]
[null,null,null,null,null,26.710000000000115,{"$f":"cubspline(3,F271,Data!$B$36:$B$56,Data!$A$36:$A$56)","v":0},1E-10,26.710000000000115,26.710000000000115]
[null,null,null,null,null,26.810000000000116,{"$f":"cubspline(3,F272,Data!$B$36:$B$56,Data!$A$36:$A$56)","v":0},1E-10,26.810000000000116,26.810000000000116]
[null,null,null,null,null,26.910000000000117,{"$f":"cubspline(3,F273,Data!$B$36:$B$56,Data!$A$36:$A$56)","v":0},1E-10,26.910000000000117,26.910000000000117]
[null,null,null,null,null,27.010000000000119,{"$f":"cubspline(3,F274,Data!$B$36:$B$56,Data!$A$36:$A$56)","v":0},1E-10,27.010000000000119,27.010000000000119]
[null,null,null,null,null,27.11000000000012,{"$f":"cubspline(3,F275,Data!$B$36:$B$56,Data!$A$36:$A$56)","v":0},1E-10,27.11000000000012,27.11000000000012]
[null,null,null,null,null,27.210000000000122,{"$f":"cubspline(3,F276,Data!$B$36:$B$56,Data!$A$36:$A$56)","v":0},1E-10,27.210000000000122,27.210000000000122]
[null,null,null,null,null,27.310000000000123,{"$f":"cubspline(3,F277,Data!$B$36:$B$56,Data!$A$36:$A$56)","v":0},1E-10,27.310000000000123,27.310000000000123]
[null,null,null,null,null,27.410000000000124,{"$f":"cubspline(3,F278,Data!$B$36:$B$56,Data!$A$36:$A$56)","v":0},1E-10,27.410000000000124,27.410000000000124]
[null,null,null,null,null,27.510000000000126,{"$f":"cubspline(3,F279,Data!$B$36:$B$56,Data!$A$36:$A$56)","v":0},1E-10,27.510000000000126,27.510000000000126]
[null,null,null,null,null,27.610000000000127,{"$f":"cubspline(3,F280,Data!$B$36:$B$56,Data!$A$36:$A$56)","v":0},1E-10,27.610000000000127,27.610000000000127]
[null,null,null,null,null,27.710000000000129,{"$f":"cubspline(3,F281,Data!$B$36:$B$56,Data!$A$36:$A$56)","v":0},1E-10,27.710000000000129,27.710000000000129]
[null,null,null,null,null,27.81000000000013,{"$f":"cubspline(3,F282,Data!$B$36:$B$56,Data!$A$36:$A$56)","v":0},1E-10,27.81000000000013,27.81000000000013]
[null,null,null,null,null,27.910000000000132,{"$f":"cubspline(3,F283,Data!$B$36:$B$56,Data!$A$36:$A$56)","v":0},1E-10,27.910000000000132,27.910000000000132]
[null,null,null,null,null,28.010000000000133,{"$f":"cubspline(3,F284,Data!$B$36:$B$56,Data!$A$36:$A$56)","v":0},1E-10,28.010000000000133,28.010000000000133]
[null,null,null,null,null,28.110000000000134,{"$f":"cubspline(3,F285,Data!$B$36:$B$56,Data!$A$36:$A$56)","v":0},1E-10,28.110000000000134,28.110000000000134]
[null,null,null,null,null,28.210000000000136,{"$f":"cubspline(3,F286,Data!$B$36:$B$56,Data!$A$36:$A$56)","v":0},1E-10,28.210000000000136,28.210000000000136]
[null,null,null,null,null,28.310000000000137,{"$f":"cubspline(3,F287,Data!$B$36:$B$56,Data!$A$36:$A$56)","v":0},1E-10,28.310000000000137,28.310000000000137]
[null,null,null,null,null,28.410000000000139,{"$f":"cubspline(3,F288,Data!$B$36:$B$56,Data!$A$36:$A$56)","v":0},1E-10,28.410000000000139,28.410000000000139]
[null,null,null,null,null,28.51000000000014,{"$f":"cubspline(3,F289,Data!$B$36:$B$56,Data!$A$36:$A$56)","v":0},1E-10,28.51000000000014,28.51000000000014]
[null,null,null,null,null,28.610000000000142,{"$f":"cubspline(3,F290,Data!$B$36:$B$56,Data!$A$36:$A$56)","v":0},1E-10,28.610000000000142,28.610000000000142]
[null,null,null,null,null,28.710000000000143,{"$f":"cubspline(3,F291,Data!$B$36:$B$56,Data!$A$36:$A$56)","v":0},1E-10,28.710000000000143,28.710000000000143]
[null,null,null,null,null,28.810000000000144,{"$f":"cubspline(3,F292,Data!$B$36:$B$56,Data!$A$36:$A$56)","v":0},1E-10,28.810000000000144,28.810000000000144]
[null,null,null,null,null,28.910000000000146,{"$f":"cubspline(3,F293,Data!$B$36:$B$56,Data!$A$36:$A$56)","v":0},1E-10,28.910000000000146,28.910000000000146]
[null,null,null,null,null,29.010000000000147,{"$f":"cubspline(3,F294,Data!$B$36:$B$56,Data!$A$36:$A$56)","v":0},1E-10,29.010000000000147,29.010000000000147]
[null,null,null,null,null,29.110000000000149,{"$f":"cubspline(3,F295,Data!$B$36:$B$56,Data!$A$36:$A$56)","v":0},1E-10,29.110000000000149,29.110000000000149]
[null,null,null,null,null,29.21000000000015,{"$f":"cubspline(3,F296,Data!$B$36:$B$56,Data!$A$36:$A$56)","v":0},1E-10,29.21000000000015,29.21000000000015]
[null,null,null,null,null,29.310000000000151,{"$f":"cubspline(3,F297,Data!$B$36:$B$56,Data!$A$36:$A$56)","v":0},1E-10,29.310000000000151,29.310000000000151]
[null,null,null,null,null,29.410000000000153,{"$f":"cubspline(3,F298,Data!$B$36:$B$56,Data!$A$36:$A$56)","v":0},1E-10,29.410000000000153,29.410000000000153]
[null,null,null,null,null,29.510000000000154,{"$f":"cubspline(3,F299,Data!$B$36:$B$56,Data!$A$36:$A$56)","v":0},1E-10,29.510000000000154,29.510000000000154]
[null,null,null,null,null,29.610000000000156,{"$f":"cubspline(3,F300,Data!$B$36:$B$56,Data!$A$36:$A$56)","v":0},1E-10,29.610000000000156,29.610000000000156]
[null,null,null,null,null,29.710000000000157,{"$f":"cubspline(3,F301,Data!$B$36:$B$56,Data!$A$36:$A$56)","v":0},1E-10,29.710000000000157,29.710000000000157]
[null,null,null,null,null,29.810000000000159,{"$f":"cubspline(3,F302,Data!$B$36:$B$56,Data!$A$36:$A$56)","v":0},1E-10,29.810000000000159,29.810000000000159]
[null,null,null,null,null,29.91000000000016,{"$f":"cubspline(3,F303,Data!$B$36:$B$56,Data!$A$36:$A$56)","v":0},1E-10,29.91000000000016,29.91000000000016]
[null,null,null,null,null,30.010000000000161,{"$f":"cubspline(3,F304,Data!$B$36:$B$56,Data!$A$36:$A$56)","v":0},1E-10,30.010000000000161,30.010000000000161]
[null,null,null,null,null,30.110000000000163,{"$f":"cubspline(3,F305,Data!$B$36:$B$56,Data!$A$36:$A$56)","v":0},1E-10,30.110000000000163,30.110000000000163]
[null,null,null,null,null,30.210000000000164,{"$f":"cubspline(3,F306,Data!$B$36:$B$56,Data!$A$36:$A$56)","v":0},1E-10,30.210000000000164,30.210000000000164]
[null,null,null,null,null,30.310000000000166,{"$f":"cubspline(3,F307,Data!$B$36:$B$56,Data!$A$36:$A$56)","v":0},1E-10,30.310000000000166,30.310000000000166]
[null,null,null,null,null,30.410000000000167,{"$f":"cubspline(3,F308,Data!$B$36:$B$56,Data!$A$36:$A$56)","v":0},1E-10,30.410000000000167,30.410000000000167]
[null,null,null,null,null,30.510000000000169,{"$f":"cubspline(3,F309,Data!$B$36:$B$56,Data!$A$36:$A$56)","v":0},1E-10,30.510000000000169,30.510000000000169]
[null,null,null,null,null,30.61000000000017,{"$f":"cubspline(3,F310,Data!$B$36:$B$56,Data!$A$36:$A$56)","v":0},1E-10,30.61000000000017,30.61000000000017]
[null,null,null,null,null,30.710000000000171,{"$f":"cubspline(3,F311,Data!$B$36:$B$56,Data!$A$36:$A$56)","v":0},1E-10,30.710000000000171,30.710000000000171]
[null,null,null,null,null,30.810000000000173,{"$f":"cubspline(3,F312,Data!$B$36:$B$56,Data!$A$36:$A$56)","v":0},1E-10,30.810000000000173,30.810000000000173]
[null,null,null,null,null,30.910000000000174,{"$f":"cubspline(3,F313,Data!$B$36:$B$56,Data!$A$36:$A$56)","v":0},1E-10,30.910000000000174,30.910000000000174]
[null,null,null,null,null,31.010000000000176,{"$f":"cubspline(3,F314,Data!$B$36:$B$56,Data!$A$36:$A$56)","v":0},1E-10,31.010000000000176,31.010000000000176]
[null,null,null,null,null,31.110000000000177,{"$f":"cubspline(3,F315,Data!$B$36:$B$56,Data!$A$36:$A$56)","v":0},1E-10,31.110000000000177,31.110000000000177]
[null,null,null,null,null,31.210000000000178,{"$f":"cubspline(3,F316,Data!$B$36:$B$56,Data!$A$36:$A$56)","v":0},1E-10,31.210000000000178,31.210000000000178]
[null,null,null,null,null,31.31000000000018,{"$f":"cubspline(3,F317,Data!$B$36:$B$56,Data!$A$36:$A$56)","v":0},1E-10,31.31000000000018,31.31000000000018]
[null,null,null,null,null,31.410000000000181,{"$f":"cubspline(3,F318,Data!$B$36:$B$56,Data!$A$36:$A$56)","v":0},1E-10,31.410000000000181,31.410000000000181]
[null,null,null,null,null,31.510000000000183,{"$f":"cubspline(3,F319,Data!$B$36:$B$56,Data!$A$36:$A$56)","v":0},1E-10,31.510000000000183,31.510000000000183]
[null,null,null,null,null,31.610000000000184,{"$f":"cubspline(3,F320,Data!$B$36:$B$56,Data!$A$36:$A$56)","v":0},1E-10,31.610000000000184,31.610000000000184]
[null,null,null,null,null,31.710000000000186,{"$f":"cubspline(3,F321,Data!$B$36:$B$56,Data!$A$36:$A$56)","v":0},1E-10,31.710000000000186,31.710000000000186]
[null,null,null,null,null,31.810000000000187,{"$f":"cubspline(3,F322,Data!$B$36:$B$56,Data!$A$36:$A$56)","v":0},1E-10,31.810000000000187,31.810000000000187]
[null,null,null,null,null,31.910000000000188,{"$f":"cubspline(3,F323,Data!$B$36:$B$56,Data!$A$36:$A$56)","v":0},1E-10,31.910000000000188,31.910000000000188]
[null,null,null,null,null,32.01000000000019,{"$f":"cubspline(3,F324,Data!$B$36:$B$56,Data!$A$36:$A$56)","v":0},1E-10,32.01000000000019,32.01000000000019]
[null,null,null,null,null,32.110000000000191,{"$f":"cubspline(3,F325,Data!$B$36:$B$56,Data!$A$36:$A$56)","v":0},1E-10,{"$f":"IF(F325>$D$47,F325,NA())","v":32.110000000000191},{"$f":"IF(F325>=$D$47,F325,($D$47-(0.3*($D$47-F325))))","v":32.110000000000191}]
[null,null,null,null,null,{"$f":"F325+0.1","v":32.210000000000193},{"$f":"cubspline(3,F326,Data!$B$36:$B$56,Data!$A$36:$A$56)","v":0},{"$f":"IF(G326<=0,0.0000000001,G326)","v":1E-10},32.210000000000193,32.210000000000193]
[null,null,null,null,null,32.310000000000194,{"$f":"cubspline(3,F327,Data!$B$36:$B$56,Data!$A$36:$A$56)","v":0},1E-10,32.310000000000194,32.310000000000194]
[null,null,null,null,null,32.410000000000196,{"$f":"cubspline(3,F328,Data!$B$36:$B$56,Data!$A$36:$A$56)","v":0},1E-10,32.410000000000196,32.410000000000196]
[null,null,null,null,null,32.510000000000197,{"$f":"cubspline(3,F329,Data!$B$36:$B$56,Data!$A$36:$A$56)","v":0},1E-10,32.510000000000197,32.510000000000197]
[null,null,null,null,null,32.610000000000198,{"$f":"cubspline(3,F330,Data!$B$36:$B$56,Data!$A$36:$A$56)","v":0},1E-10,32.610000000000198,32.610000000000198]
[null,null,null,null,null,32.7100000000002,{"$f":"cubspline(3,F331,Data!$B$36:$B$56,Data!$A$36:$A$56)","v":0},1E-10,32.7100000000002,32.7100000000002]
[null,null,null,null,null,32.810000000000201,{"$f":"cubspline(3,F332,Data!$B$36:$B$56,Data!$A$36:$A$56)","v":0},1E-10,32.810000000000201,32.810000000000201]
[null,null,null,null,null,32.910000000000203,{"$f":"cubspline(3,F333,Data!$B$36:$B$56,Data!$A$36:$A$56)","v":0},1E-10,32.910000000000203,32.910000000000203]
[null,null,null,null,null,33.010000000000204,{"$f":"cubspline(3,F334,Data!$B$36:$B$56,Data!$A$36:$A$56)","v":0},1E-10,33.010000000000204,33.010000000000204]
[null,null,null,null,null,33.110000000000205,{"$f":"cubspline(3,F335,Data!$B$36:$B$56,Data!$A$36:$A$56)","v":0},1E-10,33.110000000000205,33.110000000000205]
[null,null,null,null,null,33.210000000000207,{"$f":"cubspline(3,F336,Data!$B$36:$B$56,Data!$A$36:$A$56)","v":0},1E-10,33.210000000000207,33.210000000000207]
[null,null,null,null,null,33.310000000000208,{"$f":"cubspline(3,F337,Data!$B$36:$B$56,Data!$A$36:$A$56)","v":0},1E-10,33.310000000000208,33.310000000000208]
[null,null,null,null,null,33.41000000000021,{"$f":"cubspline(3,F338,Data!$B$36:$B$56,Data!$A$36:$A$56)","v":0},1E-10,33.41000000000021,33.41000000000021]
[null,null,null,null,null,33.510000000000211,{"$f":"cubspline(3,F339,Data!$B$36:$B$56,Data!$A$36:$A$56)","v":0},1E-10,33.510000000000211,33.510000000000211]
[null,null,null,null,null,33.610000000000213,{"$f":"cubspline(3,F340,Data!$B$36:$B$56,Data!$A$36:$A$56)","v":0},1E-10,33.610000000000213,33.610000000000213]
[null,null,null,null,null,33.710000000000214,{"$f":"cubspline(3,F341,Data!$B$36:$B$56,Data!$A$36:$A$56)","v":0},1E-10,33.710000000000214,33.710000000000214]
[null,null,null,null,null,33.810000000000215,{"$f":"cubspline(3,F342,Data!$B$36:$B$56,Data!$A$36:$A$56)","v":0},1E-10,33.810000000000215,33.810000000000215]
[null,null,null,null,null,33.910000000000217,{"$f":"cubspline(3,F343,Data!$B$36:$B$56,Data!$A$36:$A$56)","v":0},1E-10,33.910000000000217,33.910000000000217]
[null,null,null,null,null,34.010000000000218,{"$f":"cubspline(3,F344,Data!$B$36:$B$56,Data!$A$36:$A$56)","v":0},1E-10,34.010000000000218,34.010000000000218]
[null,null,null,null,null,34.11000000000022,{"$f":"cubspline(3,F345,Data!$B$36:$B$56,Data!$A$36:$A$56)","v":0},1E-10,34.11000000000022,34.11000000000022]
[null,null,null,null,null,34.210000000000221,{"$f":"cubspline(3,F346,Data!$B$36:$B$56,Data!$A$36:$A$56)","v":0},1E-10,34.210000000000221,34.210000000000221]
[null,null,null,null,null,34.310000000000223,{"$f":"cubspline(3,F347,Data!$B$36:$B$56,Data!$A$36:$A$56)","v":0},1E-10,34.310000000000223,34.310000000000223]
[null,null,null,null,null,34.410000000000224,{"$f":"cubspline(3,F348,Data!$B$36:$B$56,Data!$A$36:$A$56)","v":0},1E-10,34.410000000000224,34.410000000000224]
[null,null,null,null,null,34.510000000000225,{"$f":"cubspline(3,F349,Data!$B$36:$B$56,Data!$A$36:$A$56)","v":0},1E-10,34.510000000000225,34.510000000000225]
[null,null,null,null,null,34.610000000000227,{"$f":"cubspline(3,F350,Data!$B$36:$B$56,Data!$A$36:$A$56)","v":0},1E-10,34.610000000000227,34.610000000000227]
[null,null,null,null,null,34.710000000000228,{"$f":"cubspline(3,F351,Data!$B$36:$B$56,Data!$A$36:$A$56)","v":0},1E-10,34.710000000000228,34.710000000000228]
[null,null,null,null,null,34.81000000000023,{"$f":"cubspline(3,F352,Data!$B$36:$B$56,Data!$A$36:$A$56)","v":0},1E-10,34.81000000000023,34.81000000000023]
[null,null,null,null,null,34.910000000000231,{"$f":"cubspline(3,F353,Data!$B$36:$B$56,Data!$A$36:$A$56)","v":0},1E-10,34.910000000000231,34.910000000000231]
[null,null,null,null,null,35.010000000000232,{"$f":"cubspline(3,F354,Data!$B$36:$B$56,Data!$A$36:$A$56)","v":0},1E-10,35.010000000000232,35.010000000000232]
[null,null,null,null,null,35.110000000000234,{"$f":"cubspline(3,F355,Data!$B$36:$B$56,Data!$A$36:$A$56)","v":0},1E-10,35.110000000000234,35.110000000000234]
[null,null,null,null,null,35.210000000000235,{"$f":"cubspline(3,F356,Data!$B$36:$B$56,Data!$A$36:$A$56)","v":0},1E-10,35.210000000000235,35.210000000000235]
[null,null,null,null,null,35.310000000000237,{"$f":"cubspline(3,F357,Data!$B$36:$B$56,Data!$A$36:$A$56)","v":0},1E-10,35.310000000000237,35.310000000000237]
[null,null,null,null,null,35.410000000000238,{"$f":"cubspline(3,F358,Data!$B$36:$B$56,Data!$A$36:$A$56)","v":0},1E-10,35.410000000000238,35.410000000000238]
[null,null,null,null,null,35.51000000000024,{"$f":"cubspline(3,F359,Data!$B$36:$B$56,Data!$A$36:$A$56)","v":0},1E-10,35.51000000000024,35.51000000000024]
[null,null,null,null,null,35.610000000000241,{"$f":"cubspline(3,F360,Data!$B$36:$B$56,Data!$A$36:$A$56)","v":0},1E-10,35.610000000000241,35.610000000000241]
[null,null,null,null,null,35.710000000000242,{"$f":"cubspline(3,F361,Data!$B$36:$B$56,Data!$A$36:$A$56)","v":0},1E-10,35.710000000000242,35.710000000000242]
[null,null,null,null,null,35.810000000000244,{"$f":"cubspline(3,F362,Data!$B$36:$B$56,Data!$A$36:$A$56)","v":0},1E-10,35.810000000000244,35.810000000000244]
[null,null,null,null,null,35.910000000000245,{"$f":"cubspline(3,F363,Data!$B$36:$B$56,Data!$A$36:$A$56)","v":0},1E-10,35.910000000000245,35.910000000000245]
[null,null,null,null,null,36.010000000000247,{"$f":"cubspline(3,F364,Data!$B$36:$B$56,Data!$A$36:$A$56)","v":0},1E-10,36.010000000000247,36.010000000000247]
[null,null,null,null,null,36.110000000000248,{"$f":"cubspline(3,F365,Data!$B$36:$B$56,Data!$A$36:$A$56)","v":0},1E-10,36.110000000000248,36.110000000000248]
[null,null,null,null,null,36.21000000000025,{"$f":"cubspline(3,F366,Data!$B$36:$B$56,Data!$A$36:$A$56)","v":0},1E-10,36.21000000000025,36.21000000000025]
[null,null,null,null,null,36.310000000000251,{"$f":"cubspline(3,F367,Data!$B$36:$B$56,Data!$A$36:$A$56)","v":0},1E-10,36.310000000000251,36.310000000000251]
[null,null,null,null,null,36.410000000000252,{"$f":"cubspline(3,F368,Data!$B$36:$B$56,Data!$A$36:$A$56)","v":0},1E-10,36.410000000000252,36.410000000000252]
[null,null,null,null,null,36.510000000000254,{"$f":"cubspline(3,F369,Data!$B$36:$B$56,Data!$A$36:$A$56)","v":0},1E-10,36.510000000000254,36.510000000000254]
[null,null,null,null,null,36.610000000000255,{"$f":"cubspline(3,F370,Data!$B$36:$B$56,Data!$A$36:$A$56)","v":0},1E-10,36.610000000000255,36.610000000000255]
[null,null,null,null,null,36.710000000000257,{"$f":"cubspline(3,F371,Data!$B$36:$B$56,Data!$A$36:$A$56)","v":0},1E-10,36.710000000000257,36.710000000000257]
[null,null,null,null,null,36.810000000000258,{"$f":"cubspline(3,F372,Data!$B$36:$B$56,Data!$A$36:$A$56)","v":0},1E-10,36.810000000000258,36.810000000000258]
[null,null,null,null,null,36.910000000000259,{"$f":"cubspline(3,F373,Data!$B$36:$B$56,Data!$A$36:$A$56)","v":0},1E-10,36.910000000000259,36.910000000000259]
[null,null,null,null,null,37.010000000000261,{"$f":"cubspline(3,F374,Data!$B$36:$B$56,Data!$A$36:$A$56)","v":0},1E-10,37.010000000000261,37.010000000000261]
[null,null,null,null,null,37.110000000000262,{"$f":"cubspline(3,F375,Data!$B$36:$B$56,Data!$A$36:$A$56)","v":0},1E-10,37.110000000000262,37.110000000000262]
[null,null,null,null,null,37.210000000000264,{"$f":"cubspline(3,F376,Data!$B$36:$B$56,Data!$A$36:$A$56)","v":0},1E-10,37.210000000000264,37.210000000000264]
[null,null,null,null,null,37.310000000000265,{"$f":"cubspline(3,F377,Data!$B$36:$B$56,Data!$A$36:$A$56)","v":0},1E-10,37.310000000000265,37.310000000000265]
[null,null,null,null,null,37.410000000000267,{"$f":"cubspline(3,F378,Data!$B$36:$B$56,Data!$A$36:$A$56)","v":0},1E-10,37.410000000000267,37.410000000000267]
[null,null,null,null,null,37.510000000000268,{"$f":"cubspline(3,F379,Data!$B$36:$B$56,Data!$A$36:$A$56)","v":0},1E-10,37.510000000000268,37.510000000000268]
[null,null,null,null,null,37.610000000000269,{"$f":"cubspline(3,F380,Data!$B$36:$B$56,Data!$A$36:$A$56)","v":0},1E-10,37.610000000000269,37.610000000000269]
[null,null,null,null,null,37.710000000000271,{"$f":"cubspline(3,F381,Data!$B$36:$B$56,Data!$A$36:$A$56)","v":0},1E-10,37.710000000000271,37.710000000000271]
[null,null,null,null,null,37.810000000000272,{"$f":"cubspline(3,F382,Data!$B$36:$B$56,Data!$A$36:$A$56)","v":0},1E-10,37.810000000000272,37.810000000000272]
[null,null,null,null,null,37.910000000000274,{"$f":"cubspline(3,F383,Data!$B$36:$B$56,Data!$A$36:$A$56)","v":0},1E-10,37.910000000000274,37.910000000000274]
[null,null,null,null,null,38.010000000000275,{"$f":"cubspline(3,F384,Data!$B$36:$B$56,Data!$A$36:$A$56)","v":0},1E-10,38.010000000000275,38.010000000000275]
[null,null,null,null,null,38.110000000000277,{"$f":"cubspline(3,F385,Data!$B$36:$B$56,Data!$A$36:$A$56)","v":0},1E-10,38.110000000000277,38.110000000000277]
[null,null,null,null,null,38.210000000000278,{"$f":"cubspline(3,F386,Data!$B$36:$B$56,Data!$A$36:$A$56)","v":0},1E-10,38.210000000000278,38.210000000000278]
[null,null,null,null,null,38.310000000000279,{"$f":"cubspline(3,F387,Data!$B$36:$B$56,Data!$A$36:$A$56)","v":0},1E-10,38.310000000000279,38.310000000000279]
[null,null,null,null,null,38.410000000000281,{"$f":"cubspline(3,F388,Data!$B$36:$B$56,Data!$A$36:$A$56)","v":0},1E-10,38.410000000000281,38.410000000000281]
[null,null,null,null,null,38.510000000000282,{"$f":"cubspline(3,F389,Data!$B$36:$B$56,Data!$A$36:$A$56)","v":0},1E-10,{"$f":"IF(F389>$D$47,F389,NA())","v":38.510000000000282},{"$f":"IF(F389>=$D$47,F389,($D$47-(0.3*($D$47-F389))))","v":38.510000000000282}]
[null,null,null,null,null,{"$f":"F389+0.1","v":38.610000000000284},{"$f":"cubspline(3,F390,Data!$B$36:$B$56,Data!$A$36:$A$56)","v":0},{"$f":"IF(G390<=0,0.0000000001,G390)","v":1E-10},38.610000000000284,38.610000000000284]
[null,null,null,null,null,38.710000000000285,{"$f":"cubspline(3,F391,Data!$B$36:$B$56,Data!$A$36:$A$56)","v":0},1E-10,38.710000000000285,38.710000000000285]
[null,null,null,null,null,38.810000000000286,{"$f":"cubspline(3,F392,Data!$B$36:$B$56,Data!$A$36:$A$56)","v":0},1E-10,38.810000000000286,38.810000000000286]
[null,null,null,null,null,38.910000000000288,{"$f":"cubspline(3,F393,Data!$B$36:$B$56,Data!$A$36:$A$56)","v":0},1E-10,38.910000000000288,38.910000000000288]
[null,null,null,null,null,39.010000000000289,{"$f":"cubspline(3,F394,Data!$B$36:$B$56,Data!$A$36:$A$56)","v":0},1E-10,39.010000000000289,39.010000000000289]
[null,null,null,null,null,39.110000000000291,{"$f":"cubspline(3,F395,Data!$B$36:$B$56,Data!$A$36:$A$56)","v":0},1E-10,39.110000000000291,39.110000000000291]
[null,null,null,null,null,39.210000000000292,{"$f":"cubspline(3,F396,Data!$B$36:$B$56,Data!$A$36:$A$56)","v":0},1E-10,39.210000000000292,39.210000000000292]
[null,null,null,null,null,39.310000000000294,{"$f":"cubspline(3,F397,Data!$B$36:$B$56,Data!$A$36:$A$56)","v":0},1E-10,39.310000000000294,39.310000000000294]
[null,null,null,null,null,39.410000000000295,{"$f":"cubspline(3,F398,Data!$B$36:$B$56,Data!$A$36:$A$56)","v":0},1E-10,39.410000000000295,39.410000000000295]
[null,null,null,null,null,39.510000000000296,{"$f":"cubspline(3,F399,Data!$B$36:$B$56,Data!$A$36:$A$56)","v":0},1E-10,39.510000000000296,39.510000000000296]
[null,null,null,null,null,39.610000000000298,{"$f":"cubspline(3,F400,Data!$B$36:$B$56,Data!$A$36:$A$56)","v":0},1E-10,39.610000000000298,39.610000000000298]
[null,null,null,null,null,39.710000000000299,{"$f":"cubspline(3,F401,Data!$B$36:$B$56,Data!$A$36:$A$56)","v":0},1E-10,39.710000000000299,39.710000000000299]
[null,null,null,null,null,39.810000000000301,{"$f":"cubspline(3,F402,Data!$B$36:$B$56,Data!$A$36:$A$56)","v":0},1E-10,39.810000000000301,39.810000000000301]
[null,null,null,null,null,39.910000000000302,{"$f":"cubspline(3,F403,Data!$B$36:$B$56,Data!$A$36:$A$56)","v":0},1E-10,39.910000000000302,39.910000000000302]
[null,null,null,null,null,40.010000000000304,{"$f":"cubspline(3,F404,Data!$B$36:$B$56,Data!$A$36:$A$56)","v":0},1E-10,40.010000000000304,40.010000000000304]
[null,null,null,null,null,40.110000000000305,{"$f":"cubspline(3,F405,Data!$B$36:$B$56,Data!$A$36:$A$56)","v":0},1E-10,40.110000000000305,40.110000000000305]
[null,null,null,null,null,40.210000000000306,{"$f":"cubspline(3,F406,Data!$B$36:$B$56,Data!$A$36:$A$56)","v":0},1E-10,40.210000000000306,40.210000000000306]
[null,null,null,null,null,40.310000000000308,{"$f":"cubspline(3,F407,Data!$B$36:$B$56,Data!$A$36:$A$56)","v":0},1E-10,40.310000000000308,40.310000000000308]
[null,null,null,null,null,40.410000000000309,{"$f":"cubspline(3,F408,Data!$B$36:$B$56,Data!$A$36:$A$56)","v":0},1E-10,40.410000000000309,40.410000000000309]
[null,null,null,null,null,40.510000000000311,{"$f":"cubspline(3,F409,Data!$B$36:$B$56,Data!$A$36:$A$56)","v":0},1E-10,40.510000000000311,40.510000000000311]
[null,null,null,null,null,40.610000000000312,{"$f":"cubspline(3,F410,Data!$B$36:$B$56,Data!$A$36:$A$56)","v":0},1E-10,40.610000000000312,40.610000000000312]
[null,null,null,null,null,40.710000000000313,{"$f":"cubspline(3,F411,Data!$B$36:$B$56,Data!$A$36:$A$56)","v":0},1E-10,40.710000000000313,40.710000000000313]
[null,null,null,null,null,40.810000000000315,{"$f":"cubspline(3,F412,Data!$B$36:$B$56,Data!$A$36:$A$56)","v":0},1E-10,40.810000000000315,40.810000000000315]
[null,null,null,null,null,40.910000000000316,{"$f":"cubspline(3,F413,Data!$B$36:$B$56,Data!$A$36:$A$56)","v":0},1E-10,40.910000000000316,40.910000000000316]
[null,null,null,null,null,41.010000000000318,{"$f":"cubspline(3,F414,Data!$B$36:$B$56,Data!$A$36:$A$56)","v":0},1E-10,41.010000000000318,41.010000000000318]
[null,null,null,null,null,41.110000000000319,{"$f":"cubspline(3,F415,Data!$B$36:$B$56,Data!$A$36:$A$56)","v":0},1E-10,41.110000000000319,41.110000000000319]
[null,null,null,null,null,41.210000000000321,{"$f":"cubspline(3,F416,Data!$B$36:$B$56,Data!$A$36:$A$56)","v":0},1E-10,41.210000000000321,41.210000000000321]
[null,null,null,null,null,41.310000000000322,{"$f":"cubspline(3,F417,Data!$B$36:$B$56,Data!$A$36:$A$56)","v":0},1E-10,41.310000000000322,41.310000000000322]
[null,null,null,null,null,41.410000000000323,{"$f":"cubspline(3,F418,Data!$B$36:$B$56,Data!$A$36:$A$56)","v":0},1E-10,41.410000000000323,41.410000000000323]
[null,null,null,null,null,41.510000000000325,{"$f":"cubspline(3,F419,Data!$B$36:$B$56,Data!$A$36:$A$56)","v":0},1E-10,41.510000000000325,41.510000000000325]
[null,null,null,null,null,41.610000000000326,{"$f":"cubspline(3,F420,Data!$B$36:$B$56,Data!$A$36:$A$56)","v":0},1E-10,41.610000000000326,41.610000000000326]
[null,null,null,null,null,41.710000000000328,{"$f":"cubspline(3,F421,Data!$B$36:$B$56,Data!$A$36:$A$56)","v":0},1E-10,41.710000000000328,41.710000000000328]
[null,null,null,null,null,41.810000000000329,{"$f":"cubspline(3,F422,Data!$B$36:$B$56,Data!$A$36:$A$56)","v":0},1E-10,41.810000000000329,41.810000000000329]
[null,null,null,null,null,41.910000000000331,{"$f":"cubspline(3,F423,Data!$B$36:$B$56,Data!$A$36:$A$56)","v":0},1E-10,41.910000000000331,41.910000000000331]
[null,null,null,null,null,42.010000000000332,{"$f":"cubspline(3,F424,Data!$B$36:$B$56,Data!$A$36:$A$56)","v":0},1E-10,42.010000000000332,42.010000000000332]
[null,null,null,null,null,42.110000000000333,{"$f":"cubspline(3,F425,Data!$B$36:$B$56,Data!$A$36:$A$56)","v":0},1E-10,42.110000000000333,42.110000000000333]
[null,null,null,null,null,42.210000000000335,{"$f":"cubspline(3,F426,Data!$B$36:$B$56,Data!$A$36:$A$56)","v":0},1E-10,42.210000000000335,42.210000000000335]
[null,null,null,null,null,42.310000000000336,{"$f":"cubspline(3,F427,Data!$B$36:$B$56,Data!$A$36:$A$56)","v":0},1E-10,42.310000000000336,42.310000000000336]
[null,null,null,null,null,42.410000000000338,{"$f":"cubspline(3,F428,Data!$B$36:$B$56,Data!$A$36:$A$56)","v":0},1E-10,42.410000000000338,42.410000000000338]
[null,null,null,null,null,42.510000000000339,{"$f":"cubspline(3,F429,Data!$B$36:$B$56,Data!$A$36:$A$56)","v":0},1E-10,42.510000000000339,42.510000000000339]
[null,null,null,null,null,42.61000000000034,{"$f":"cubspline(3,F430,Data!$B$36:$B$56,Data!$A$36:$A$56)","v":0},1E-10,42.61000000000034,42.61000000000034]
[null,null,null,null,null,42.710000000000342,{"$f":"cubspline(3,F431,Data!$B$36:$B$56,Data!$A$36:$A$56)","v":0},1E-10,42.710000000000342,42.710000000000342]
[null,null,null,null,null,42.810000000000343,{"$f":"cubspline(3,F432,Data!$B$36:$B$56,Data!$A$36:$A$56)","v":0},1E-10,42.810000000000343,42.810000000000343]
[null,null,null,null,null,42.910000000000345,{"$f":"cubspline(3,F433,Data!$B$36:$B$56,Data!$A$36:$A$56)","v":0},1E-10,42.910000000000345,42.910000000000345]
[null,null,null,null,null,43.010000000000346,{"$f":"cubspline(3,F434,Data!$B$36:$B$56,Data!$A$36:$A$56)","v":0},1E-10,43.010000000000346,43.010000000000346]
[null,null,null,null,null,43.110000000000348,{"$f":"cubspline(3,F435,Data!$B$36:$B$56,Data!$A$36:$A$56)","v":0},1E-10,43.110000000000348,43.110000000000348]
[null,null,null,null,null,43.210000000000349,{"$f":"cubspline(3,F436,Data!$B$36:$B$56,Data!$A$36:$A$56)","v":0},1E-10,43.210000000000349,43.210000000000349]
[null,null,null,null,null,43.31000000000035,{"$f":"cubspline(3,F437,Data!$B$36:$B$56,Data!$A$36:$A$56)","v":0},1E-10,43.31000000000035,43.31000000000035]
[null,null,null,null,null,43.410000000000352,{"$f":"cubspline(3,F438,Data!$B$36:$B$56,Data!$A$36:$A$56)","v":0},1E-10,43.410000000000352,43.410000000000352]
[null,null,null,null,null,43.510000000000353,{"$f":"cubspline(3,F439,Data!$B$36:$B$56,Data!$A$36:$A$56)","v":0},1E-10,43.510000000000353,43.510000000000353]
[null,null,null,null,null,43.610000000000355,{"$f":"cubspline(3,F440,Data!$B$36:$B$56,Data!$A$36:$A$56)","v":0},1E-10,43.610000000000355,43.610000000000355]
[null,null,null,null,null,43.710000000000356,{"$f":"cubspline(3,F441,Data!$B$36:$B$56,Data!$A$36:$A$56)","v":0},1E-10,43.710000000000356,43.710000000000356]
[null,null,null,null,null,43.810000000000358,{"$f":"cubspline(3,F442,Data!$B$36:$B$56,Data!$A$36:$A$56)","v":0},1E-10,43.810000000000358,43.810000000000358]
[null,null,null,null,null,43.910000000000359,{"$f":"cubspline(3,F443,Data!$B$36:$B$56,Data!$A$36:$A$56)","v":0},1E-10,43.910000000000359,43.910000000000359]
[null,null,null,null,null,44.01000000000036,{"$f":"cubspline(3,F444,Data!$B$36:$B$56,Data!$A$36:$A$56)","v":0},1E-10,44.01000000000036,44.01000000000036]
[null,null,null,null,null,44.110000000000362,{"$f":"cubspline(3,F445,Data!$B$36:$B$56,Data!$A$36:$A$56)","v":0},1E-10,44.110000000000362,44.110000000000362]
[null,null,null,null,null,44.210000000000363,{"$f":"cubspline(3,F446,Data!$B$36:$B$56,Data!$A$36:$A$56)","v":0},1E-10,44.210000000000363,44.210000000000363]
[null,null,null,null,null,44.310000000000365,{"$f":"cubspline(3,F447,Data!$B$36:$B$56,Data!$A$36:$A$56)","v":0},1E-10,44.310000000000365,44.310000000000365]
[null,null,null,null,null,44.410000000000366,{"$f":"cubspline(3,F448,Data!$B$36:$B$56,Data!$A$36:$A$56)","v":0},1E-10,44.410000000000366,44.410000000000366]
[null,null,null,null,null,44.510000000000367,{"$f":"cubspline(3,F449,Data!$B$36:$B$56,Data!$A$36:$A$56)","v":0},1E-10,44.510000000000367,44.510000000000367]
[null,null,null,null,null,44.610000000000369,{"$f":"cubspline(3,F450,Data!$B$36:$B$56,Data!$A$36:$A$56)","v":0},1E-10,44.610000000000369,44.610000000000369]
[null,null,null,null,null,44.71000000000037,{"$f":"cubspline(3,F451,Data!$B$36:$B$56,Data!$A$36:$A$56)","v":0},1E-10,44.71000000000037,44.71000000000037]
[null,null,null,null,null,44.810000000000372,{"$f":"cubspline(3,F452,Data!$B$36:$B$56,Data!$A$36:$A$56)","v":0},1E-10,44.810000000000372,44.810000000000372]
[null,null,null,null,null,44.910000000000373,{"$f":"cubspline(3,F453,Data!$B$36:$B$56,Data!$A$36:$A$56)","v":0},1E-10,{"$f":"IF(F453>$D$47,F453,NA())","v":44.910000000000373},{"$f":"IF(F453>=$D$47,F453,($D$47-(0.3*($D$47-F453))))","v":44.910000000000373}]
[null,null,null,null,null,{"$f":"F453+0.1","v":45.010000000000375},{"$f":"cubspline(3,F454,Data!$B$36:$B$56,Data!$A$36:$A$56)","v":0},{"$f":"IF(G454<=0,0.0000000001,G454)","v":1E-10},45.010000000000375,45.010000000000375]
[null,null,null,null,null,45.110000000000376,{"$f":"cubspline(3,F455,Data!$B$36:$B$56,Data!$A$36:$A$56)","v":0},1E-10,45.110000000000376,45.110000000000376]
[null,null,null,null,null,45.210000000000377,{"$f":"cubspline(3,F456,Data!$B$36:$B$56,Data!$A$36:$A$56)","v":0},1E-10,45.210000000000377,45.210000000000377]
[null,null,null,null,null,45.310000000000379,{"$f":"cubspline(3,F457,Data!$B$36:$B$56,Data!$A$36:$A$56)","v":0},1E-10,45.310000000000379,45.310000000000379]
[null,null,null,null,null,45.41000000000038,{"$f":"cubspline(3,F458,Data!$B$36:$B$56,Data!$A$36:$A$56)","v":0},1E-10,45.41000000000038,45.41000000000038]
[null,null,null,null,null,45.510000000000382,{"$f":"cubspline(3,F459,Data!$B$36:$B$56,Data!$A$36:$A$56)","v":0},1E-10,45.510000000000382,45.510000000000382]
[null,null,null,null,null,45.610000000000383,{"$f":"cubspline(3,F460,Data!$B$36:$B$56,Data!$A$36:$A$56)","v":0},1E-10,45.610000000000383,45.610000000000383]
[null,null,null,null,null,45.710000000000385,{"$f":"cubspline(3,F461,Data!$B$36:$B$56,Data!$A$36:$A$56)","v":0},1E-10,45.710000000000385,45.710000000000385]
[null,null,null,null,null,45.810000000000386,{"$f":"cubspline(3,F462,Data!$B$36:$B$56,Data!$A$36:$A$56)","v":0},1E-10,45.810000000000386,45.810000000000386]
[null,null,null,null,null,45.910000000000387,{"$f":"cubspline(3,F463,Data!$B$36:$B$56,Data!$A$36:$A$56)","v":0},1E-10,45.910000000000387,45.910000000000387]
[null,null,null,null,null,46.010000000000389,{"$f":"cubspline(3,F464,Data!$B$36:$B$56,Data!$A$36:$A$56)","v":0},1E-10,46.010000000000389,46.010000000000389]
[null,null,null,null,null,46.11000000000039,{"$f":"cubspline(3,F465,Data!$B$36:$B$56,Data!$A$36:$A$56)","v":0},1E-10,46.11000000000039,46.11000000000039]
[null,null,null,null,null,46.210000000000392,{"$f":"cubspline(3,F466,Data!$B$36:$B$56,Data!$A$36:$A$56)","v":0},1E-10,46.210000000000392,46.210000000000392]
[null,null,null,null,null,46.310000000000393,{"$f":"cubspline(3,F467,Data!$B$36:$B$56,Data!$A$36:$A$56)","v":0},1E-10,46.310000000000393,46.310000000000393]
[null,null,null,null,null,46.410000000000394,{"$f":"cubspline(3,F468,Data!$B$36:$B$56,Data!$A$36:$A$56)","v":0},1E-10,46.410000000000394,46.410000000000394]
[null,null,null,null,null,46.510000000000396,{"$f":"cubspline(3,F469,Data!$B$36:$B$56,Data!$A$36:$A$56)","v":0},1E-10,46.510000000000396,46.510000000000396]
[null,null,null,null,null,46.610000000000397,{"$f":"cubspline(3,F470,Data!$B$36:$B$56,Data!$A$36:$A$56)","v":0},1E-10,46.610000000000397,46.610000000000397]
[null,null,null,null,null,46.710000000000399,{"$f":"cubspline(3,F471,Data!$B$36:$B$56,Data!$A$36:$A$56)","v":0},1E-10,46.710000000000399,46.710000000000399]
[null,null,null,null,null,46.8100000000004,{"$f":"cubspline(3,F472,Data!$B$36:$B$56,Data!$A$36:$A$56)","v":0},1E-10,46.8100000000004,46.8100000000004]
[null,null,null,null,null,46.910000000000402,{"$f":"cubspline(3,F473,Data!$B$36:$B$56,Data!$A$36:$A$56)","v":0},1E-10,46.910000000000402,46.910000000000402]
[null,null,null,null,null,47.010000000000403,{"$f":"cubspline(3,F474,Data!$B$36:$B$56,Data!$A$36:$A$56)","v":0},1E-10,47.010000000000403,47.010000000000403]
[null,null,null,null,null,47.110000000000404,{"$f":"cubspline(3,F475,Data!$B$36:$B$56,Data!$A$36:$A$56)","v":0},1E-10,47.110000000000404,47.110000000000404]
[null,null,null,null,null,47.210000000000406,{"$f":"cubspline(3,F476,Data!$B$36:$B$56,Data!$A$36:$A$56)","v":0},1E-10,47.210000000000406,47.210000000000406]
[null,null,null,null,null,47.310000000000407,{"$f":"cubspline(3,F477,Data!$B$36:$B$56,Data!$A$36:$A$56)","v":0},1E-10,47.310000000000407,47.310000000000407]
[null,null,null,null,null,47.410000000000409,{"$f":"cubspline(3,F478,Data!$B$36:$B$56,Data!$A$36:$A$56)","v":0},1E-10,47.410000000000409,47.410000000000409]
[null,null,null,null,null,47.51000000000041,{"$f":"cubspline(3,F479,Data!$B$36:$B$56,Data!$A$36:$A$56)","v":0},1E-10,47.51000000000041,47.51000000000041]
[null,null,null,null,null,47.610000000000412,{"$f":"cubspline(3,F480,Data!$B$36:$B$56,Data!$A$36:$A$56)","v":0},1E-10,47.610000000000412,47.610000000000412]
[null,null,null,null,null,47.710000000000413,{"$f":"cubspline(3,F481,Data!$B$36:$B$56,Data!$A$36:$A$56)","v":0},1E-10,47.710000000000413,47.710000000000413]
[null,null,null,null,null,47.810000000000414,{"$f":"cubspline(3,F482,Data!$B$36:$B$56,Data!$A$36:$A$56)","v":0},1E-10,47.810000000000414,47.810000000000414]
[null,null,null,null,null,47.910000000000416,{"$f":"cubspline(3,F483,Data!$B$36:$B$56,Data!$A$36:$A$56)","v":0},1E-10,47.910000000000416,47.910000000000416]
[null,null,null,null,null,48.010000000000417,{"$f":"cubspline(3,F484,Data!$B$36:$B$56,Data!$A$36:$A$56)","v":0},1E-10,48.010000000000417,48.010000000000417]
[null,null,null,null,null,48.110000000000419,{"$f":"cubspline(3,F485,Data!$B$36:$B$56,Data!$A$36:$A$56)","v":0},1E-10,48.110000000000419,48.110000000000419]
[null,null,null,null,null,48.21000000000042,{"$f":"cubspline(3,F486,Data!$B$36:$B$56,Data!$A$36:$A$56)","v":0},1E-10,48.21000000000042,48.21000000000042]
[null,null,null,null,null,48.310000000000421,{"$f":"cubspline(3,F487,Data!$B$36:$B$56,Data!$A$36:$A$56)","v":0},1E-10,48.310000000000421,48.310000000000421]
[null,null,null,null,null,48.410000000000423,{"$f":"cubspline(3,F488,Data!$B$36:$B$56,Data!$A$36:$A$56)","v":0},1E-10,48.410000000000423,48.410000000000423]
[null,null,null,null,null,48.510000000000424,{"$f":"cubspline(3,F489,Data!$B$36:$B$56,Data!$A$36:$A$56)","v":0},1E-10,48.510000000000424,48.510000000000424]
[null,null,null,null,null,48.610000000000426,{"$f":"cubspline(3,F490,Data!$B$36:$B$56,Data!$A$36:$A$56)","v":0},1E-10,48.610000000000426,48.610000000000426]
[null,null,null,null,null,48.710000000000427,{"$f":"cubspline(3,F491,Data!$B$36:$B$56,Data!$A$36:$A$56)","v":0},1E-10,48.710000000000427,48.710000000000427]
[null,null,null,null,null,48.810000000000429,{"$f":"cubspline(3,F492,Data!$B$36:$B$56,Data!$A$36:$A$56)","v":0},1E-10,48.810000000000429,48.810000000000429]
[null,null,null,null,null,48.91000000000043,{"$f":"cubspline(3,F493,Data!$B$36:$B$56,Data!$A$36:$A$56)","v":0},1E-10,48.91000000000043,48.91000000000043]
[null,null,null,null,null,49.010000000000431,{"$f":"cubspline(3,F494,Data!$B$36:$B$56,Data!$A$36:$A$56)","v":0},1E-10,49.010000000000431,49.010000000000431]
[null,null,null,null,null,49.110000000000433,{"$f":"cubspline(3,F495,Data!$B$36:$B$56,Data!$A$36:$A$56)","v":0},1E-10,49.110000000000433,49.110000000000433]
[null,null,null,null,null,49.210000000000434,{"$f":"cubspline(3,F496,Data!$B$36:$B$56,Data!$A$36:$A$56)","v":0},1E-10,49.210000000000434,49.210000000000434]
[null,null,null,null,null,49.310000000000436,{"$f":"cubspline(3,F497,Data!$B$36:$B$56,Data!$A$36:$A$56)","v":0},1E-10,49.310000000000436,49.310000000000436]
[null,null,null,null,null,49.410000000000437,{"$f":"cubspline(3,F498,Data!$B$36:$B$56,Data!$A$36:$A$56)","v":0},1E-10,49.410000000000437,49.410000000000437]
[null,null,null,null,null,49.510000000000439,{"$f":"cubspline(3,F499,Data!$B$36:$B$56,Data!$A$36:$A$56)","v":0},1E-10,49.510000000000439,49.510000000000439]
[null,null,null,null,null,49.61000000000044,{"$f":"cubspline(3,F500,Data!$B$36:$B$56,Data!$A$36:$A$56)","v":0},1E-10,49.61000000000044,49.61000000000044]
[null,null,null,null,null,49.710000000000441,{"$f":"cubspline(3,F501,Data!$B$36:$B$56,Data!$A$36:$A$56)","v":0},1E-10,49.710000000000441,49.710000000000441]
[null,null,null,null,null,49.810000000000443,{"$f":"cubspline(3,F502,Data!$B$36:$B$56,Data!$A$36:$A$56)","v":0},1E-10,49.810000000000443,49.810000000000443]
[null,null,null,null,null,49.910000000000444,{"$f":"cubspline(3,F503,Data!$B$36:$B$56,Data!$A$36:$A$56)","v":0},1E-10,49.910000000000444,49.910000000000444]
[null,null,null,null,null,50.010000000000446,{"$f":"cubspline(3,F504,Data!$B$36:$B$56,Data!$A$36:$A$56)","v":0},1E-10,50.010000000000446,50.010000000000446]
[null,null,null,null,null,50.110000000000447,{"$f":"cubspline(3,F505,Data!$B$36:$B$56,Data!$A$36:$A$56)","v":0},1E-10,50.110000000000447,50.110000000000447]
[null,null,null,null,null,50.210000000000448,{"$f":"cubspline(3,F506,Data!$B$36:$B$56,Data!$A$36:$A$56)","v":0},1E-10,50.210000000000448,50.210000000000448]
[null,null,null,null,null,50.31000000000045,{"$f":"cubspline(3,F507,Data!$B$36:$B$56,Data!$A$36:$A$56)","v":0},1E-10,50.31000000000045,50.31000000000045]
[null,null,null,null,null,50.410000000000451,{"$f":"cubspline(3,F508,Data!$B$36:$B$56,Data!$A$36:$A$56)","v":0},1E-10,50.410000000000451,50.410000000000451]
[null,null,null,null,null,50.510000000000453,{"$f":"cubspline(3,F509,Data!$B$36:$B$56,Data!$A$36:$A$56)","v":0},1E-10,50.510000000000453,50.510000000000453]
[null,null,null,null,null,50.610000000000454,{"$f":"cubspline(3,F510,Data!$B$36:$B$56,Data!$A$36:$A$56)","v":0},1E-10,50.610000000000454,50.610000000000454]
[null,null,null,null,null,50.710000000000456,{"$f":"cubspline(3,F511,Data!$B$36:$B$56,Data!$A$36:$A$56)","v":0},1E-10,50.710000000000456,50.710000000000456]
[null,null,null,null,null,50.810000000000457,{"$f":"cubspline(3,F512,Data!$B$36:$B$56,Data!$A$36:$A$56)","v":0},1E-10,50.810000000000457,50.810000000000457]
[null,null,null,null,null,50.910000000000458,{"$f":"cubspline(3,F513,Data!$B$36:$B$56,Data!$A$36:$A$56)","v":0},1E-10,50.910000000000458,50.910000000000458]
[null,null,null,null,null,51.01000000000046,{"$f":"cubspline(3,F514,Data!$B$36:$B$56,Data!$A$36:$A$56)","v":0},1E-10,51.01000000000046,51.01000000000046]
[null,null,null,null,null,51.110000000000461,{"$f":"cubspline(3,F515,Data!$B$36:$B$56,Data!$A$36:$A$56)","v":0},1E-10,51.110000000000461,51.110000000000461]
[null,null,null,null,null,51.210000000000463,{"$f":"cubspline(3,F516,Data!$B$36:$B$56,Data!$A$36:$A$56)","v":0},1E-10,51.210000000000463,51.210000000000463]
[null,null,null,null,null,51.310000000000464,{"$f":"cubspline(3,F517,Data!$B$36:$B$56,Data!$A$36:$A$56)","v":0},1E-10,{"$f":"IF(F517>$D$47,F517,NA())","v":51.310000000000464},{"$f":"IF(F517>=$D$47,F517,($D$47-(0.3*($D$47-F517))))","v":51.310000000000464}]
[null,null,null,null,null,{"$f":"F517+0.1","v":51.410000000000466},{"$f":"cubspline(3,F518,Data!$B$36:$B$56,Data!$A$36:$A$56)","v":0},{"$f":"IF(G518<=0,0.0000000001,G518)","v":1E-10},51.410000000000466,51.410000000000466]
[null,null,null,null,null,51.510000000000467,{"$f":"cubspline(3,F519,Data!$B$36:$B$56,Data!$A$36:$A$56)","v":0},1E-10,51.510000000000467,51.510000000000467]
[null,null,null,null,null,51.610000000000468,{"$f":"cubspline(3,F520,Data!$B$36:$B$56,Data!$A$36:$A$56)","v":0},1E-10,51.610000000000468,51.610000000000468]
[null,null,null,null,null,51.71000000000047,{"$f":"cubspline(3,F521,Data!$B$36:$B$56,Data!$A$36:$A$56)","v":0},1E-10,51.71000000000047,51.71000000000047]
[null,null,null,null,null,51.810000000000471,{"$f":"cubspline(3,F522,Data!$B$36:$B$56,Data!$A$36:$A$56)","v":0},1E-10,51.810000000000471,51.810000000000471]
[null,null,null,null,null,51.910000000000473,{"$f":"cubspline(3,F523,Data!$B$36:$B$56,Data!$A$36:$A$56)","v":0},1E-10,51.910000000000473,51.910000000000473]
[null,null,null,null,null,52.010000000000474,{"$f":"cubspline(3,F524,Data!$B$36:$B$56,Data!$A$36:$A$56)","v":0},1E-10,52.010000000000474,52.010000000000474]
[null,null,null,null,null,52.110000000000475,{"$f":"cubspline(3,F525,Data!$B$36:$B$56,Data!$A$36:$A$56)","v":0},1E-10,52.110000000000475,52.110000000000475]
[null,null,null,null,null,52.210000000000477,{"$f":"cubspline(3,F526,Data!$B$36:$B$56,Data!$A$36:$A$56)","v":0},1E-10,52.210000000000477,52.210000000000477]
[null,null,null,null,null,52.310000000000478,{"$f":"cubspline(3,F527,Data!$B$36:$B$56,Data!$A$36:$A$56)","v":0},1E-10,52.310000000000478,52.310000000000478]
[null,null,null,null,null,52.41000000000048,{"$f":"cubspline(3,F528,Data!$B$36:$B$56,Data!$A$36:$A$56)","v":0},1E-10,52.41000000000048,52.41000000000048]
[null,null,null,null,null,52.510000000000481,{"$f":"cubspline(3,F529,Data!$B$36:$B$56,Data!$A$36:$A$56)","v":0},1E-10,52.510000000000481,52.510000000000481]
[null,null,null,null,null,52.610000000000483,{"$f":"cubspline(3,F530,Data!$B$36:$B$56,Data!$A$36:$A$56)","v":0},1E-10,52.610000000000483,52.610000000000483]
[null,null,null,null,null,52.710000000000484,{"$f":"cubspline(3,F531,Data!$B$36:$B$56,Data!$A$36:$A$56)","v":0},1E-10,52.710000000000484,52.710000000000484]
[null,null,null,null,null,52.810000000000485,{"$f":"cubspline(3,F532,Data!$B$36:$B$56,Data!$A$36:$A$56)","v":0},1E-10,52.810000000000485,52.810000000000485]
[null,null,null,null,null,52.910000000000487,{"$f":"cubspline(3,F533,Data!$B$36:$B$56,Data!$A$36:$A$56)","v":0},1E-10,52.910000000000487,52.910000000000487]
[null,null,null,null,null,53.010000000000488,{"$f":"cubspline(3,F534,Data!$B$36:$B$56,Data!$A$36:$A$56)","v":0},1E-10,53.010000000000488,53.010000000000488]
[null,null,null,null,null,53.11000000000049,{"$f":"cubspline(3,F535,Data!$B$36:$B$56,Data!$A$36:$A$56)","v":0},1E-10,53.11000000000049,53.11000000000049]
[null,null,null,null,null,53.210000000000491,{"$f":"cubspline(3,F536,Data!$B$36:$B$56,Data!$A$36:$A$56)","v":0},1E-10,53.210000000000491,53.210000000000491]
[null,null,null,null,null,53.310000000000493,{"$f":"cubspline(3,F537,Data!$B$36:$B$56,Data!$A$36:$A$56)","v":0},1E-10,53.310000000000493,53.310000000000493]
[null,null,null,null,null,53.410000000000494,{"$f":"cubspline(3,F538,Data!$B$36:$B$56,Data!$A$36:$A$56)","v":0},1E-10,53.410000000000494,53.410000000000494]
[null,null,null,null,null,53.510000000000495,{"$f":"cubspline(3,F539,Data!$B$36:$B$56,Data!$A$36:$A$56)","v":0},1E-10,53.510000000000495,53.510000000000495]
[null,null,null,null,null,53.610000000000497,{"$f":"cubspline(3,F540,Data!$B$36:$B$56,Data!$A$36:$A$56)","v":0},1E-10,53.610000000000497,53.610000000000497]
[null,null,null,null,null,53.710000000000498,{"$f":"cubspline(3,F541,Data!$B$36:$B$56,Data!$A$36:$A$56)","v":0},1E-10,53.710000000000498,53.710000000000498]
[null,null,null,null,null,53.8100000000005,{"$f":"cubspline(3,F542,Data!$B$36:$B$56,Data!$A$36:$A$56)","v":0},1E-10,53.8100000000005,53.8100000000005]
[null,null,null,null,null,53.910000000000501,{"$f":"cubspline(3,F543,Data!$B$36:$B$56,Data!$A$36:$A$56)","v":0},1E-10,53.910000000000501,53.910000000000501]
[null,null,null,null,null,54.010000000000502,{"$f":"cubspline(3,F544,Data!$B$36:$B$56,Data!$A$36:$A$56)","v":0},1E-10,54.010000000000502,54.010000000000502]
[null,null,null,null,null,54.110000000000504,{"$f":"cubspline(3,F545,Data!$B$36:$B$56,Data!$A$36:$A$56)","v":0},1E-10,54.110000000000504,54.110000000000504]
[null,null,null,null,null,54.210000000000505,{"$f":"cubspline(3,F546,Data!$B$36:$B$56,Data!$A$36:$A$56)","v":0},1E-10,54.210000000000505,54.210000000000505]
[null,null,null,null,null,54.310000000000507,{"$f":"cubspline(3,F547,Data!$B$36:$B$56,Data!$A$36:$A$56)","v":0},1E-10,54.310000000000507,54.310000000000507]
[null,null,null,null,null,54.410000000000508,{"$f":"cubspline(3,F548,Data!$B$36:$B$56,Data!$A$36:$A$56)","v":0},1E-10,54.410000000000508,54.410000000000508]
[null,null,null,null,null,54.51000000000051,{"$f":"cubspline(3,F549,Data!$B$36:$B$56,Data!$A$36:$A$56)","v":0},1E-10,54.51000000000051,54.51000000000051]
[null,null,null,null,null,54.610000000000511,{"$f":"cubspline(3,F550,Data!$B$36:$B$56,Data!$A$36:$A$56)","v":0},1E-10,54.610000000000511,54.610000000000511]
[null,null,null,null,null,54.710000000000512,{"$f":"cubspline(3,F551,Data!$B$36:$B$56,Data!$A$36:$A$56)","v":0},1E-10,54.710000000000512,54.710000000000512]
[null,null,null,null,null,54.810000000000514,{"$f":"cubspline(3,F552,Data!$B$36:$B$56,Data!$A$36:$A$56)","v":0},1E-10,54.810000000000514,54.810000000000514]
[null,null,null,null,null,54.910000000000515,{"$f":"cubspline(3,F553,Data!$B$36:$B$56,Data!$A$36:$A$56)","v":0},1E-10,54.910000000000515,54.910000000000515]
[null,null,null,null,null,55.010000000000517,{"$f":"cubspline(3,F554,Data!$B$36:$B$56,Data!$A$36:$A$56)","v":0},1E-10,55.010000000000517,55.010000000000517]
[null,null,null,null,null,55.110000000000518,{"$f":"cubspline(3,F555,Data!$B$36:$B$56,Data!$A$36:$A$56)","v":0},1E-10,55.110000000000518,55.110000000000518]
[null,null,null,null,null,55.21000000000052,{"$f":"cubspline(3,F556,Data!$B$36:$B$56,Data!$A$36:$A$56)","v":0},1E-10,55.21000000000052,55.21000000000052]
[null,null,null,null,null,55.310000000000521,{"$f":"cubspline(3,F557,Data!$B$36:$B$56,Data!$A$36:$A$56)","v":0},1E-10,55.310000000000521,55.310000000000521]
[null,null,null,null,null,55.410000000000522,{"$f":"cubspline(3,F558,Data!$B$36:$B$56,Data!$A$36:$A$56)","v":0},1E-10,55.410000000000522,55.410000000000522]
[null,null,null,null,null,55.510000000000524,{"$f":"cubspline(3,F559,Data!$B$36:$B$56,Data!$A$36:$A$56)","v":0},1E-10,55.510000000000524,55.510000000000524]
[null,null,null,null,null,55.610000000000525,{"$f":"cubspline(3,F560,Data!$B$36:$B$56,Data!$A$36:$A$56)","v":0},1E-10,55.610000000000525,55.610000000000525]
[null,null,null,null,null,55.710000000000527,{"$f":"cubspline(3,F561,Data!$B$36:$B$56,Data!$A$36:$A$56)","v":0},1E-10,55.710000000000527,55.710000000000527]
[null,null,null,null,null,55.810000000000528,{"$f":"cubspline(3,F562,Data!$B$36:$B$56,Data!$A$36:$A$56)","v":0},1E-10,55.810000000000528,55.810000000000528]
[null,null,null,null,null,55.910000000000529,{"$f":"cubspline(3,F563,Data!$B$36:$B$56,Data!$A$36:$A$56)","v":0},1E-10,55.910000000000529,55.910000000000529]
[null,null,null,null,null,56.010000000000531,{"$f":"cubspline(3,F564,Data!$B$36:$B$56,Data!$A$36:$A$56)","v":0},1E-10,56.010000000000531,56.010000000000531]
[null,null,null,null,null,56.110000000000532,{"$f":"cubspline(3,F565,Data!$B$36:$B$56,Data!$A$36:$A$56)","v":0},1E-10,56.110000000000532,56.110000000000532]
[null,null,null,null,null,56.210000000000534,{"$f":"cubspline(3,F566,Data!$B$36:$B$56,Data!$A$36:$A$56)","v":0},1E-10,56.210000000000534,56.210000000000534]
[null,null,null,null,null,56.310000000000535,{"$f":"cubspline(3,F567,Data!$B$36:$B$56,Data!$A$36:$A$56)","v":0},1E-10,56.310000000000535,56.310000000000535]
[null,null,null,null,null,56.410000000000537,{"$f":"cubspline(3,F568,Data!$B$36:$B$56,Data!$A$36:$A$56)","v":0},1E-10,56.410000000000537,56.410000000000537]
[null,null,null,null,null,56.510000000000538,{"$f":"cubspline(3,F569,Data!$B$36:$B$56,Data!$A$36:$A$56)","v":0},1E-10,56.510000000000538,56.510000000000538]
[null,null,null,null,null,56.610000000000539,{"$f":"cubspline(3,F570,Data!$B$36:$B$56,Data!$A$36:$A$56)","v":0},1E-10,56.610000000000539,56.610000000000539]
[null,null,null,null,null,56.710000000000541,{"$f":"cubspline(3,F571,Data!$B$36:$B$56,Data!$A$36:$A$56)","v":0},1E-10,56.710000000000541,56.710000000000541]
[null,null,null,null,null,56.810000000000542,{"$f":"cubspline(3,F572,Data!$B$36:$B$56,Data!$A$36:$A$56)","v":0},1E-10,56.810000000000542,56.810000000000542]
[null,null,null,null,null,56.910000000000544,{"$f":"cubspline(3,F573,Data!$B$36:$B$56,Data!$A$36:$A$56)","v":0},1E-10,56.910000000000544,56.910000000000544]
[null,null,null,null,null,57.010000000000545,{"$f":"cubspline(3,F574,Data!$B$36:$B$56,Data!$A$36:$A$56)","v":0},1E-10,57.010000000000545,57.010000000000545]
[null,null,null,null,null,57.110000000000547,{"$f":"cubspline(3,F575,Data!$B$36:$B$56,Data!$A$36:$A$56)","v":0},1E-10,57.110000000000547,57.110000000000547]
[null,null,null,null,null,57.210000000000548,{"$f":"cubspline(3,F576,Data!$B$36:$B$56,Data!$A$36:$A$56)","v":0},1E-10,57.210000000000548,57.210000000000548]
[null,null,null,null,null,57.310000000000549,{"$f":"cubspline(3,F577,Data!$B$36:$B$56,Data!$A$36:$A$56)","v":0},1E-10,57.310000000000549,57.310000000000549]
[null,null,null,null,null,57.410000000000551,{"$f":"cubspline(3,F578,Data!$B$36:$B$56,Data!$A$36:$A$56)","v":0},1E-10,57.410000000000551,57.410000000000551]
[null,null,null,null,null,57.510000000000552,{"$f":"cubspline(3,F579,Data!$B$36:$B$56,Data!$A$36:$A$56)","v":0},1E-10,57.510000000000552,57.510000000000552]
[null,null,null,null,null,57.610000000000554,{"$f":"cubspline(3,F580,Data!$B$36:$B$56,Data!$A$36:$A$56)","v":0},1E-10,57.610000000000554,57.610000000000554]
[null,null,null,null,null,57.710000000000555,{"$f":"cubspline(3,F581,Data!$B$36:$B$56,Data!$A$36:$A$56)","v":0},1E-10,{"$f":"IF(F581>$D$47,F581,NA())","v":57.710000000000555},{"$f":"IF(F581>=$D$47,F581,($D$47-(0.3*($D$47-F581))))","v":57.710000000000555}]
[null,null,null,null,null,{"$f":"F581+0.1","v":57.810000000000556},{"$f":"cubspline(3,F582,Data!$B$36:$B$56,Data!$A$36:$A$56)","v":0},{"$f":"IF(G582<=0,0.0000000001,G582)","v":1E-10},57.810000000000556,57.810000000000556]
[null,null,null,null,null,57.910000000000558,{"$f":"cubspline(3,F583,Data!$B$36:$B$56,Data!$A$36:$A$56)","v":0},1E-10,57.910000000000558,57.910000000000558]
[null,null,null,null,null,58.010000000000559,{"$f":"cubspline(3,F584,Data!$B$36:$B$56,Data!$A$36:$A$56)","v":0},1E-10,58.010000000000559,58.010000000000559]
[null,null,null,null,null,58.110000000000561,{"$f":"cubspline(3,F585,Data!$B$36:$B$56,Data!$A$36:$A$56)","v":0},1E-10,58.110000000000561,58.110000000000561]
[null,null,null,null,null,58.210000000000562,{"$f":"cubspline(3,F586,Data!$B$36:$B$56,Data!$A$36:$A$56)","v":0},1E-10,58.210000000000562,58.210000000000562]
[null,null,null,null,null,58.310000000000564,{"$f":"cubspline(3,F587,Data!$B$36:$B$56,Data!$A$36:$A$56)","v":0},1E-10,58.310000000000564,58.310000000000564]
[null,null,null,null,null,58.410000000000565,{"$f":"cubspline(3,F588,Data!$B$36:$B$56,Data!$A$36:$A$56)","v":0},1E-10,58.410000000000565,58.410000000000565]
[null,null,null,null,null,58.510000000000566,{"$f":"cubspline(3,F589,Data!$B$36:$B$56,Data!$A$36:$A$56)","v":0},1E-10,58.510000000000566,58.510000000000566]
[null,null,null,null,null,58.610000000000568,{"$f":"cubspline(3,F590,Data!$B$36:$B$56,Data!$A$36:$A$56)","v":0},1E-10,58.610000000000568,58.610000000000568]
[null,null,null,null,null,58.710000000000569,{"$f":"cubspline(3,F591,Data!$B$36:$B$56,Data!$A$36:$A$56)","v":0},1E-10,58.710000000000569,58.710000000000569]
[null,null,null,null,null,58.810000000000571,{"$f":"cubspline(3,F592,Data!$B$36:$B$56,Data!$A$36:$A$56)","v":0},1E-10,58.810000000000571,58.810000000000571]
[null,null,null,null,null,58.910000000000572,{"$f":"cubspline(3,F593,Data!$B$36:$B$56,Data!$A$36:$A$56)","v":0},1E-10,58.910000000000572,58.910000000000572]
[null,null,null,null,null,59.010000000000574,{"$f":"cubspline(3,F594,Data!$B$36:$B$56,Data!$A$36:$A$56)","v":0},1E-10,59.010000000000574,59.010000000000574]
[null,null,null,null,null,59.110000000000575,{"$f":"cubspline(3,F595,Data!$B$36:$B$56,Data!$A$36:$A$56)","v":0},1E-10,59.110000000000575,59.110000000000575]
[null,null,null,null,null,59.210000000000576,{"$f":"cubspline(3,F596,Data!$B$36:$B$56,Data!$A$36:$A$56)","v":0},1E-10,59.210000000000576,59.210000000000576]
[null,null,null,null,null,59.310000000000578,{"$f":"cubspline(3,F597,Data!$B$36:$B$56,Data!$A$36:$A$56)","v":0},1E-10,59.310000000000578,59.310000000000578]
[null,null,null,null,null,59.410000000000579,{"$f":"cubspline(3,F598,Data!$B$36:$B$56,Data!$A$36:$A$56)","v":0},1E-10,59.410000000000579,59.410000000000579]
[null,null,null,null,null,59.510000000000581,{"$f":"cubspline(3,F599,Data!$B$36:$B$56,Data!$A$36:$A$56)","v":0},1E-10,59.510000000000581,59.510000000000581]
[null,null,null,null,null,59.610000000000582,{"$f":"cubspline(3,F600,Data!$B$36:$B$56,Data!$A$36:$A$56)","v":0},1E-10,59.610000000000582,59.610000000000582]
[null,null,null,null,null,59.710000000000583,{"$f":"cubspline(3,F601,Data!$B$36:$B$56,Data!$A$36:$A$56)","v":0},1E-10,59.710000000000583,59.710000000000583]
[null,null,null,null,null,59.810000000000585,{"$f":"cubspline(3,F602,Data!$B$36:$B$56,Data!$A$36:$A$56)","v":0},1E-10,59.810000000000585,59.810000000000585]
[null,null,null,null,null,59.910000000000586,{"$f":"cubspline(3,F603,Data!$B$36:$B$56,Data!$A$36:$A$56)","v":0},1E-10,59.910000000000586,59.910000000000586]
[null,null,null,null,null,60.010000000000588,{"$f":"cubspline(3,F604,Data!$B$36:$B$56,Data!$A$36:$A$56)","v":0},1E-10,60.010000000000588,60.010000000000588]
[null,null,null,null,null,60.110000000000589,{"$f":"cubspline(3,F605,Data!$B$36:$B$56,Data!$A$36:$A$56)","v":0},1E-10,60.110000000000589,60.110000000000589]
[null,null,null,null,null,60.210000000000591,{"$f":"cubspline(3,F606,Data!$B$36:$B$56,Data!$A$36:$A$56)","v":0},1E-10,60.210000000000591,60.210000000000591]
[null,null,null,null,null,60.310000000000592,{"$f":"cubspline(3,F607,Data!$B$36:$B$56,Data!$A$36:$A$56)","v":0},1E-10,60.310000000000592,60.310000000000592]
[null,null,null,null,null,60.410000000000593,{"$f":"cubspline(3,F608,Data!$B$36:$B$56,Data!$A$36:$A$56)","v":0},1E-10,60.410000000000593,60.410000000000593]
[null,null,null,null,null,60.510000000000595,{"$f":"cubspline(3,F609,Data!$B$36:$B$56,Data!$A$36:$A$56)","v":0},1E-10,60.510000000000595,60.510000000000595]
[null,null,null,null,null,60.610000000000596,{"$f":"cubspline(3,F610,Data!$B$36:$B$56,Data!$A$36:$A$56)","v":0},1E-10,60.610000000000596,60.610000000000596]
[null,null,null,null,null,60.710000000000598,{"$f":"cubspline(3,F611,Data!$B$36:$B$56,Data!$A$36:$A$56)","v":0},1E-10,60.710000000000598,60.710000000000598]
[null,null,null,null,null,60.810000000000599,{"$f":"cubspline(3,F612,Data!$B$36:$B$56,Data!$A$36:$A$56)","v":0},1E-10,60.810000000000599,60.810000000000599]
[null,null,null,null,null,60.910000000000601,{"$f":"cubspline(3,F613,Data!$B$36:$B$56,Data!$A$36:$A$56)","v":0},1E-10,60.910000000000601,60.910000000000601]
[null,null,null,null,null,61.010000000000602,{"$f":"cubspline(3,F614,Data!$B$36:$B$56,Data!$A$36:$A$56)","v":0},1E-10,61.010000000000602,61.010000000000602]
[null,null,null,null,null,61.110000000000603,{"$f":"cubspline(3,F615,Data!$B$36:$B$56,Data!$A$36:$A$56)","v":0},1E-10,61.110000000000603,61.110000000000603]
[null,null,null,null,null,61.210000000000605,{"$f":"cubspline(3,F616,Data!$B$36:$B$56,Data!$A$36:$A$56)","v":0},1E-10,61.210000000000605,61.210000000000605]
[null,null,null,null,null,61.310000000000606,{"$f":"cubspline(3,F617,Data!$B$36:$B$56,Data!$A$36:$A$56)","v":0},1E-10,61.310000000000606,61.310000000000606]
[null,null,null,null,null,61.410000000000608,{"$f":"cubspline(3,F618,Data!$B$36:$B$56,Data!$A$36:$A$56)","v":0},1E-10,61.410000000000608,61.410000000000608]
[null,null,null,null,null,61.510000000000609,{"$f":"cubspline(3,F619,Data!$B$36:$B$56,Data!$A$36:$A$56)","v":0},1E-10,61.510000000000609,61.510000000000609]
[null,null,null,null,null,61.61000000000061,{"$f":"cubspline(3,F620,Data!$B$36:$B$56,Data!$A$36:$A$56)","v":0},1E-10,61.61000000000061,61.61000000000061]
[null,null,null,null,null,61.710000000000612,{"$f":"cubspline(3,F621,Data!$B$36:$B$56,Data!$A$36:$A$56)","v":0},1E-10,61.710000000000612,61.710000000000612]
[null,null,null,null,null,61.810000000000613,{"$f":"cubspline(3,F622,Data!$B$36:$B$56,Data!$A$36:$A$56)","v":0},1E-10,61.810000000000613,61.810000000000613]
[null,null,null,null,null,61.910000000000615,{"$f":"cubspline(3,F623,Data!$B$36:$B$56,Data!$A$36:$A$56)","v":0},1E-10,61.910000000000615,61.910000000000615]
[null,null,null,null,null,62.010000000000616,{"$f":"cubspline(3,F624,Data!$B$36:$B$56,Data!$A$36:$A$56)","v":0},1E-10,62.010000000000616,62.010000000000616]
[null,null,null,null,null,62.110000000000618,{"$f":"cubspline(3,F625,Data!$B$36:$B$56,Data!$A$36:$A$56)","v":0},1E-10,62.110000000000618,62.110000000000618]
[null,null,null,null,null,62.210000000000619,{"$f":"cubspline(3,F626,Data!$B$36:$B$56,Data!$A$36:$A$56)","v":0},1E-10,62.210000000000619,62.210000000000619]
[null,null,null,null,null,62.31000000000062,{"$f":"cubspline(3,F627,Data!$B$36:$B$56,Data!$A$36:$A$56)","v":0},1E-10,62.31000000000062,62.31000000000062]
[null,null,null,null,null,62.410000000000622,{"$f":"cubspline(3,F628,Data!$B$36:$B$56,Data!$A$36:$A$56)","v":0},1E-10,62.410000000000622,62.410000000000622]
[null,null,null,null,null,62.510000000000623,{"$f":"cubspline(3,F629,Data!$B$36:$B$56,Data!$A$36:$A$56)","v":0},1E-10,62.510000000000623,62.510000000000623]
[null,null,null,null,null,62.610000000000625,{"$f":"cubspline(3,F630,Data!$B$36:$B$56,Data!$A$36:$A$56)","v":0},1E-10,62.610000000000625,62.610000000000625]
[null,null,null,null,null,62.710000000000626,{"$f":"cubspline(3,F631,Data!$B$36:$B$56,Data!$A$36:$A$56)","v":0},1E-10,62.710000000000626,62.710000000000626]
[null,null,null,null,null,62.810000000000628,{"$f":"cubspline(3,F632,Data!$B$36:$B$56,Data!$A$36:$A$56)","v":0},1E-10,62.810000000000628,62.810000000000628]
[null,null,null,null,null,62.910000000000629,{"$f":"cubspline(3,F633,Data!$B$36:$B$56,Data!$A$36:$A$56)","v":0},1E-10,62.910000000000629,62.910000000000629]
[null,null,null,null,null,63.01000000000063,{"$f":"cubspline(3,F634,Data!$B$36:$B$56,Data!$A$36:$A$56)","v":0},1E-10,63.01000000000063,63.01000000000063]
[null,null,null,null,null,63.110000000000632,{"$f":"cubspline(3,F635,Data!$B$36:$B$56,Data!$A$36:$A$56)","v":0},1E-10,63.110000000000632,63.110000000000632]
[null,null,null,null,null,63.210000000000633,{"$f":"cubspline(3,F636,Data!$B$36:$B$56,Data!$A$36:$A$56)","v":0},1E-10,63.210000000000633,63.210000000000633]
[null,null,null,null,null,63.310000000000635,{"$f":"cubspline(3,F637,Data!$B$36:$B$56,Data!$A$36:$A$56)","v":0},1E-10,63.310000000000635,63.310000000000635]
[null,null,null,null,null,63.410000000000636,{"$f":"cubspline(3,F638,Data!$B$36:$B$56,Data!$A$36:$A$56)","v":0},1E-10,63.410000000000636,63.410000000000636]
[null,null,null,null,null,63.510000000000637,{"$f":"cubspline(3,F639,Data!$B$36:$B$56,Data!$A$36:$A$56)","v":0},1E-10,63.510000000000637,63.510000000000637]
[null,null,null,null,null,63.610000000000639,{"$f":"cubspline(3,F640,Data!$B$36:$B$56,Data!$A$36:$A$56)","v":0},1E-10,63.610000000000639,63.610000000000639]
[null,null,null,null,null,63.71000000000064,{"$f":"cubspline(3,F641,Data!$B$36:$B$56,Data!$A$36:$A$56)","v":0},1E-10,63.71000000000064,63.71000000000064]
[null,null,null,null,null,63.810000000000642,{"$f":"cubspline(3,F642,Data!$B$36:$B$56,Data!$A$36:$A$56)","v":0},1E-10,63.810000000000642,63.810000000000642]
[null,null,null,null,null,63.910000000000643,{"$f":"cubspline(3,F643,Data!$B$36:$B$56,Data!$A$36:$A$56)","v":0},1E-10,63.910000000000643,63.910000000000643]
[null,null,null,null,null,64.010000000000645,{"$f":"cubspline(3,F644,Data!$B$36:$B$56,Data!$A$36:$A$56)","v":0},1E-10,64.010000000000645,64.010000000000645]
[null,null,null,null,null,64.110000000000639,{"$f":"cubspline(3,F645,Data!$B$36:$B$56,Data!$A$36:$A$56)","v":0},1E-10,{"$f":"IF(F645>$D$47,F645,NA())","v":64.110000000000639},{"$f":"IF(F645>=$D$47,F645,($D$47-(0.3*($D$47-F645))))","v":64.110000000000639}]
[null,null,null,null,null,{"$f":"F645+0.1","v":64.210000000000633},{"$f":"cubspline(3,F646,Data!$B$36:$B$56,Data!$A$36:$A$56)","v":0},{"$f":"IF(G646<=0,0.0000000001,G646)","v":1E-10},64.210000000000633,64.210000000000633]
[null,null,null,null,null,64.310000000000628,{"$f":"cubspline(3,F647,Data!$B$36:$B$56,Data!$A$36:$A$56)","v":0},1E-10,64.310000000000628,64.310000000000628]
[null,null,null,null,null,64.410000000000622,{"$f":"cubspline(3,F648,Data!$B$36:$B$56,Data!$A$36:$A$56)","v":0},1E-10,64.410000000000622,64.410000000000622]
[null,null,null,null,null,64.510000000000616,{"$f":"cubspline(3,F649,Data!$B$36:$B$56,Data!$A$36:$A$56)","v":0},1E-10,64.510000000000616,64.510000000000616]
[null,null,null,null,null,64.61000000000061,{"$f":"cubspline(3,F650,Data!$B$36:$B$56,Data!$A$36:$A$56)","v":0},1E-10,64.61000000000061,64.61000000000061]
[null,null,null,null,null,64.710000000000605,{"$f":"cubspline(3,F651,Data!$B$36:$B$56,Data!$A$36:$A$56)","v":0},1E-10,64.710000000000605,64.710000000000605]
[null,null,null,null,null,64.810000000000599,{"$f":"cubspline(3,F652,Data!$B$36:$B$56,Data!$A$36:$A$56)","v":0},1E-10,64.810000000000599,64.810000000000599]
[null,null,null,null,null,64.910000000000593,{"$f":"cubspline(3,F653,Data!$B$36:$B$56,Data!$A$36:$A$56)","v":0},1E-10,64.910000000000593,64.910000000000593]
[null,null,null,null,null,65.010000000000588,{"$f":"cubspline(3,F654,Data!$B$36:$B$56,Data!$A$36:$A$56)","v":0},1E-10,65.010000000000588,65.010000000000588]
[null,null,null,null,null,65.110000000000582,{"$f":"cubspline(3,F655,Data!$B$36:$B$56,Data!$A$36:$A$56)","v":0},1E-10,65.110000000000582,65.110000000000582]
[null,null,null,null,null,65.210000000000576,{"$f":"cubspline(3,F656,Data!$B$36:$B$56,Data!$A$36:$A$56)","v":0},1E-10,65.210000000000576,65.210000000000576]
[null,null,null,null,null,65.310000000000571,{"$f":"cubspline(3,F657,Data!$B$36:$B$56,Data!$A$36:$A$56)","v":0},1E-10,65.310000000000571,65.310000000000571]
[null,null,null,null,null,65.410000000000565,{"$f":"cubspline(3,F658,Data!$B$36:$B$56,Data!$A$36:$A$56)","v":0},1E-10,65.410000000000565,65.410000000000565]
[null,null,null,null,null,65.510000000000559,{"$f":"cubspline(3,F659,Data!$B$36:$B$56,Data!$A$36:$A$56)","v":0},1E-10,65.510000000000559,65.510000000000559]
[null,null,null,null,null,65.610000000000554,{"$f":"cubspline(3,F660,Data!$B$36:$B$56,Data!$A$36:$A$56)","v":0},1E-10,65.610000000000554,65.610000000000554]
[null,null,null,null,null,65.710000000000548,{"$f":"cubspline(3,F661,Data!$B$36:$B$56,Data!$A$36:$A$56)","v":0},1E-10,65.710000000000548,65.710000000000548]
[null,null,null,null,null,65.810000000000542,{"$f":"cubspline(3,F662,Data!$B$36:$B$56,Data!$A$36:$A$56)","v":0},1E-10,65.810000000000542,65.810000000000542]
[null,null,null,null,null,65.910000000000537,{"$f":"cubspline(3,F663,Data!$B$36:$B$56,Data!$A$36:$A$56)","v":0},1E-10,65.910000000000537,65.910000000000537]
[null,null,null,null,null,66.010000000000531,{"$f":"cubspline(3,F664,Data!$B$36:$B$56,Data!$A$36:$A$56)","v":0},1E-10,66.010000000000531,66.010000000000531]
[null,null,null,null,null,66.110000000000525,{"$f":"cubspline(3,F665,Data!$B$36:$B$56,Data!$A$36:$A$56)","v":0},1E-10,66.110000000000525,66.110000000000525]
[null,null,null,null,null,66.21000000000052,{"$f":"cubspline(3,F666,Data!$B$36:$B$56,Data!$A$36:$A$56)","v":0},1E-10,66.21000000000052,66.21000000000052]
[null,null,null,null,null,66.310000000000514,{"$f":"cubspline(3,F667,Data!$B$36:$B$56,Data!$A$36:$A$56)","v":0},1E-10,66.310000000000514,66.310000000000514]
[null,null,null,null,null,66.410000000000508,{"$f":"cubspline(3,F668,Data!$B$36:$B$56,Data!$A$36:$A$56)","v":0},1E-10,66.410000000000508,66.410000000000508]
[null,null,null,null,null,66.510000000000502,{"$f":"cubspline(3,F669,Data!$B$36:$B$56,Data!$A$36:$A$56)","v":0},1E-10,66.510000000000502,66.510000000000502]
[null,null,null,null,null,66.610000000000497,{"$f":"cubspline(3,F670,Data!$B$36:$B$56,Data!$A$36:$A$56)","v":0},1E-10,66.610000000000497,66.610000000000497]
[null,null,null,null,null,66.710000000000491,{"$f":"cubspline(3,F671,Data!$B$36:$B$56,Data!$A$36:$A$56)","v":0},1E-10,66.710000000000491,66.710000000000491]
[null,null,null,null,null,66.810000000000485,{"$f":"cubspline(3,F672,Data!$B$36:$B$56,Data!$A$36:$A$56)","v":0},1E-10,66.810000000000485,66.810000000000485]
[null,null,null,null,null,66.91000000000048,{"$f":"cubspline(3,F673,Data!$B$36:$B$56,Data!$A$36:$A$56)","v":0},1E-10,66.91000000000048,66.91000000000048]
[null,null,null,null,null,67.010000000000474,{"$f":"cubspline(3,F674,Data!$B$36:$B$56,Data!$A$36:$A$56)","v":0},1E-10,67.010000000000474,67.010000000000474]
[null,null,null,null,null,67.110000000000468,{"$f":"cubspline(3,F675,Data!$B$36:$B$56,Data!$A$36:$A$56)","v":0},1E-10,67.110000000000468,67.110000000000468]
[null,null,null,null,null,67.210000000000463,{"$f":"cubspline(3,F676,Data!$B$36:$B$56,Data!$A$36:$A$56)","v":0},1E-10,67.210000000000463,67.210000000000463]
[null,null,null,null,null,67.310000000000457,{"$f":"cubspline(3,F677,Data!$B$36:$B$56,Data!$A$36:$A$56)","v":0},1E-10,67.310000000000457,67.310000000000457]
[null,null,null,null,null,67.410000000000451,{"$f":"cubspline(3,F678,Data!$B$36:$B$56,Data!$A$36:$A$56)","v":0},1E-10,67.410000000000451,67.410000000000451]
[null,null,null,null,null,67.510000000000446,{"$f":"cubspline(3,F679,Data!$B$36:$B$56,Data!$A$36:$A$56)","v":0},1E-10,67.510000000000446,67.510000000000446]
[null,null,null,null,null,67.61000000000044,{"$f":"cubspline(3,F680,Data!$B$36:$B$56,Data!$A$36:$A$56)","v":0},1E-10,67.61000000000044,67.61000000000044]
[null,null,null,null,null,67.710000000000434,{"$f":"cubspline(3,F681,Data!$B$36:$B$56,Data!$A$36:$A$56)","v":0},1E-10,67.710000000000434,67.710000000000434]
[null,null,null,null,null,67.810000000000429,{"$f":"cubspline(3,F682,Data!$B$36:$B$56,Data!$A$36:$A$56)","v":0},1E-10,67.810000000000429,67.810000000000429]
[null,null,null,null,null,67.910000000000423,{"$f":"cubspline(3,F683,Data!$B$36:$B$56,Data!$A$36:$A$56)","v":0},1E-10,67.910000000000423,67.910000000000423]
[null,null,null,null,null,68.010000000000417,{"$f":"cubspline(3,F684,Data!$B$36:$B$56,Data!$A$36:$A$56)","v":0},1E-10,68.010000000000417,68.010000000000417]
[null,null,null,null,null,68.110000000000412,{"$f":"cubspline(3,F685,Data!$B$36:$B$56,Data!$A$36:$A$56)","v":0},1E-10,68.110000000000412,68.110000000000412]
[null,null,null,null,null,68.210000000000406,{"$f":"cubspline(3,F686,Data!$B$36:$B$56,Data!$A$36:$A$56)","v":0},1E-10,68.210000000000406,68.210000000000406]
[null,null,null,null,null,68.3100000000004,{"$f":"cubspline(3,F687,Data!$B$36:$B$56,Data!$A$36:$A$56)","v":0},1E-10,68.3100000000004,68.3100000000004]
[null,null,null,null,null,68.410000000000394,{"$f":"cubspline(3,F688,Data!$B$36:$B$56,Data!$A$36:$A$56)","v":0},1E-10,68.410000000000394,68.410000000000394]
[null,null,null,null,null,68.510000000000389,{"$f":"cubspline(3,F689,Data!$B$36:$B$56,Data!$A$36:$A$56)","v":0},1E-10,68.510000000000389,68.510000000000389]
[null,null,null,null,null,68.610000000000383,{"$f":"cubspline(3,F690,Data!$B$36:$B$56,Data!$A$36:$A$56)","v":0},1E-10,68.610000000000383,68.610000000000383]
[null,null,null,null,null,68.710000000000377,{"$f":"cubspline(3,F691,Data!$B$36:$B$56,Data!$A$36:$A$56)","v":0},1E-10,68.710000000000377,68.710000000000377]
[null,null,null,null,null,68.810000000000372,{"$f":"cubspline(3,F692,Data!$B$36:$B$56,Data!$A$36:$A$56)","v":0},1E-10,68.810000000000372,68.810000000000372]
[null,null,null,null,null,68.910000000000366,{"$f":"cubspline(3,F693,Data!$B$36:$B$56,Data!$A$36:$A$56)","v":0},1E-10,68.910000000000366,68.910000000000366]
[null,null,null,null,null,69.01000000000036,{"$f":"cubspline(3,F694,Data!$B$36:$B$56,Data!$A$36:$A$56)","v":0},1E-10,69.01000000000036,69.01000000000036]
[null,null,null,null,null,69.110000000000355,{"$f":"cubspline(3,F695,Data!$B$36:$B$56,Data!$A$36:$A$56)","v":0},1E-10,69.110000000000355,69.110000000000355]
[null,null,null,null,null,69.210000000000349,{"$f":"cubspline(3,F696,Data!$B$36:$B$56,Data!$A$36:$A$56)","v":0},1E-10,69.210000000000349,69.210000000000349]
[null,null,null,null,null,69.310000000000343,{"$f":"cubspline(3,F697,Data!$B$36:$B$56,Data!$A$36:$A$56)","v":0},1E-10,69.310000000000343,69.310000000000343]
[null,null,null,null,null,69.410000000000338,{"$f":"cubspline(3,F698,Data!$B$36:$B$56,Data!$A$36:$A$56)","v":0},1E-10,69.410000000000338,69.410000000000338]
[null,null,null,null,null,69.510000000000332,{"$f":"cubspline(3,F699,Data!$B$36:$B$56,Data!$A$36:$A$56)","v":0},1E-10,69.510000000000332,69.510000000000332]
[null,null,null,null,null,69.610000000000326,{"$f":"cubspline(3,F700,Data!$B$36:$B$56,Data!$A$36:$A$56)","v":0},1E-10,69.610000000000326,69.610000000000326]
[null,null,null,null,null,69.710000000000321,{"$f":"cubspline(3,F701,Data!$B$36:$B$56,Data!$A$36:$A$56)","v":0},1E-10,69.710000000000321,69.710000000000321]
[null,null,null,null,null,69.810000000000315,{"$f":"cubspline(3,F702,Data!$B$36:$B$56,Data!$A$36:$A$56)","v":0},1E-10,69.810000000000315,69.810000000000315]
[null,null,null,null,null,69.910000000000309,{"$f":"cubspline(3,F703,Data!$B$36:$B$56,Data!$A$36:$A$56)","v":0},1E-10,69.910000000000309,69.910000000000309]
[null,null,null,null,null,70.010000000000304,{"$f":"cubspline(3,F704,Data!$B$36:$B$56,Data!$A$36:$A$56)","v":0},1E-10,70.010000000000304,70.010000000000304]
[null,null,null,null,null,70.110000000000298,{"$f":"cubspline(3,F705,Data!$B$36:$B$56,Data!$A$36:$A$56)","v":0},1E-10,70.110000000000298,70.110000000000298]
[null,null,null,null,null,70.210000000000292,{"$f":"cubspline(3,F706,Data!$B$36:$B$56,Data!$A$36:$A$56)","v":0},1E-10,70.210000000000292,70.210000000000292]
[null,null,null,null,null,70.310000000000286,{"$f":"cubspline(3,F707,Data!$B$36:$B$56,Data!$A$36:$A$56)","v":0},1E-10,70.310000000000286,70.310000000000286]
[null,null,null,null,null,70.410000000000281,{"$f":"cubspline(3,F708,Data!$B$36:$B$56,Data!$A$36:$A$56)","v":0},1E-10,70.410000000000281,70.410000000000281]
[null,null,null,null,null,70.510000000000275,{"$f":"cubspline(3,F709,Data!$B$36:$B$56,Data!$A$36:$A$56)","v":0},1E-10,{"$f":"IF(F709>$D$47,F709,NA())","v":70.510000000000275},{"$f":"IF(F709>=$D$47,F709,($D$47-(0.3*($D$47-F709))))","v":70.510000000000275}]
[null,null,null,null,null,{"$f":"F709+0.1","v":70.610000000000269},{"$f":"cubspline(3,F710,Data!$B$36:$B$56,Data!$A$36:$A$56)","v":0},{"$f":"IF(G710<=0,0.0000000001,G710)","v":1E-10},70.610000000000269,70.610000000000269]
[null,null,null,null,null,70.710000000000264,{"$f":"cubspline(3,F711,Data!$B$36:$B$56,Data!$A$36:$A$56)","v":0},1E-10,70.710000000000264,70.710000000000264]
[null,null,null,null,null,70.810000000000258,{"$f":"cubspline(3,F712,Data!$B$36:$B$56,Data!$A$36:$A$56)","v":0},1E-10,70.810000000000258,70.810000000000258]
[null,null,null,null,null,70.910000000000252,{"$f":"cubspline(3,F713,Data!$B$36:$B$56,Data!$A$36:$A$56)","v":0},1E-10,70.910000000000252,70.910000000000252]
[null,null,null,null,null,71.010000000000247,{"$f":"cubspline(3,F714,Data!$B$36:$B$56,Data!$A$36:$A$56)","v":0},1E-10,71.010000000000247,71.010000000000247]
[null,null,null,null,null,71.110000000000241,{"$f":"cubspline(3,F715,Data!$B$36:$B$56,Data!$A$36:$A$56)","v":0},1E-10,71.110000000000241,71.110000000000241]
[null,null,null,null,null,71.210000000000235,{"$f":"cubspline(3,F716,Data!$B$36:$B$56,Data!$A$36:$A$56)","v":0},1E-10,71.210000000000235,71.210000000000235]
[null,null,null,null,null,71.31000000000023,{"$f":"cubspline(3,F717,Data!$B$36:$B$56,Data!$A$36:$A$56)","v":0},1E-10,71.31000000000023,71.31000000000023]
[null,null,null,null,null,71.410000000000224,{"$f":"cubspline(3,F718,Data!$B$36:$B$56,Data!$A$36:$A$56)","v":0},1E-10,71.410000000000224,71.410000000000224]
[null,null,null,null,null,71.510000000000218,{"$f":"cubspline(3,F719,Data!$B$36:$B$56,Data!$A$36:$A$56)","v":0},1E-10,71.510000000000218,71.510000000000218]
[null,null,null,null,null,71.610000000000213,{"$f":"cubspline(3,F720,Data!$B$36:$B$56,Data!$A$36:$A$56)","v":0},1E-10,71.610000000000213,71.610000000000213]
[null,null,null,null,null,71.710000000000207,{"$f":"cubspline(3,F721,Data!$B$36:$B$56,Data!$A$36:$A$56)","v":0},1E-10,71.710000000000207,71.710000000000207]
[null,null,null,null,null,71.810000000000201,{"$f":"cubspline(3,F722,Data!$B$36:$B$56,Data!$A$36:$A$56)","v":0},1E-10,71.810000000000201,71.810000000000201]
[null,null,null,null,null,71.910000000000196,{"$f":"cubspline(3,F723,Data!$B$36:$B$56,Data!$A$36:$A$56)","v":0},1E-10,71.910000000000196,71.910000000000196]
[null,null,null,null,null,72.01000000000019,{"$f":"cubspline(3,F724,Data!$B$36:$B$56,Data!$A$36:$A$56)","v":0},1E-10,72.01000000000019,72.01000000000019]
[null,null,null,null,null,72.110000000000184,{"$f":"cubspline(3,F725,Data!$B$36:$B$56,Data!$A$36:$A$56)","v":0},1E-10,72.110000000000184,72.110000000000184]
[null,null,null,null,null,72.210000000000178,{"$f":"cubspline(3,F726,Data!$B$36:$B$56,Data!$A$36:$A$56)","v":0},1E-10,72.210000000000178,72.210000000000178]
[null,null,null,null,null,72.310000000000173,{"$f":"cubspline(3,F727,Data!$B$36:$B$56,Data!$A$36:$A$56)","v":0},1E-10,72.310000000000173,72.310000000000173]
[null,null,null,null,null,72.410000000000167,{"$f":"cubspline(3,F728,Data!$B$36:$B$56,Data!$A$36:$A$56)","v":0},1E-10,72.410000000000167,72.410000000000167]
[null,null,null,null,null,72.510000000000161,{"$f":"cubspline(3,F729,Data!$B$36:$B$56,Data!$A$36:$A$56)","v":0},1E-10,72.510000000000161,72.510000000000161]
[null,null,null,null,null,72.610000000000156,{"$f":"cubspline(3,F730,Data!$B$36:$B$56,Data!$A$36:$A$56)","v":0},1E-10,72.610000000000156,72.610000000000156]
[null,null,null,null,null,72.71000000000015,{"$f":"cubspline(3,F731,Data!$B$36:$B$56,Data!$A$36:$A$56)","v":0},1E-10,72.71000000000015,72.71000000000015]
[null,null,null,null,null,72.810000000000144,{"$f":"cubspline(3,F732,Data!$B$36:$B$56,Data!$A$36:$A$56)","v":0},1E-10,72.810000000000144,72.810000000000144]
[null,null,null,null,null,72.910000000000139,{"$f":"cubspline(3,F733,Data!$B$36:$B$56,Data!$A$36:$A$56)","v":0},1E-10,72.910000000000139,72.910000000000139]
[null,null,null,null,null,73.010000000000133,{"$f":"cubspline(3,F734,Data!$B$36:$B$56,Data!$A$36:$A$56)","v":0},1E-10,73.010000000000133,73.010000000000133]
[null,null,null,null,null,73.110000000000127,{"$f":"cubspline(3,F735,Data!$B$36:$B$56,Data!$A$36:$A$56)","v":0},1E-10,73.110000000000127,73.110000000000127]
[null,null,null,null,null,73.210000000000122,{"$f":"cubspline(3,F736,Data!$B$36:$B$56,Data!$A$36:$A$56)","v":0},1E-10,73.210000000000122,73.210000000000122]
[null,null,null,null,null,73.310000000000116,{"$f":"cubspline(3,F737,Data!$B$36:$B$56,Data!$A$36:$A$56)","v":0},1E-10,73.310000000000116,73.310000000000116]
[null,null,null,null,null,73.41000000000011,{"$f":"cubspline(3,F738,Data!$B$36:$B$56,Data!$A$36:$A$56)","v":0},1E-10,73.41000000000011,73.41000000000011]
[null,null,null,null,null,73.510000000000105,{"$f":"cubspline(3,F739,Data!$B$36:$B$56,Data!$A$36:$A$56)","v":0},1E-10,73.510000000000105,73.510000000000105]
[null,null,null,null,null,73.610000000000099,{"$f":"cubspline(3,F740,Data!$B$36:$B$56,Data!$A$36:$A$56)","v":0},1E-10,73.610000000000099,73.610000000000099]
[null,null,null,null,null,73.710000000000093,{"$f":"cubspline(3,F741,Data!$B$36:$B$56,Data!$A$36:$A$56)","v":0},1E-10,73.710000000000093,73.710000000000093]
[null,null,null,null,null,73.810000000000088,{"$f":"cubspline(3,F742,Data!$B$36:$B$56,Data!$A$36:$A$56)","v":0},1E-10,73.810000000000088,73.810000000000088]
[null,null,null,null,null,73.910000000000082,{"$f":"cubspline(3,F743,Data!$B$36:$B$56,Data!$A$36:$A$56)","v":0},1E-10,73.910000000000082,73.910000000000082]
[null,null,null,null,null,74.010000000000076,{"$f":"cubspline(3,F744,Data!$B$36:$B$56,Data!$A$36:$A$56)","v":0},1E-10,74.010000000000076,74.010000000000076]
[null,null,null,null,null,74.11000000000007,{"$f":"cubspline(3,F745,Data!$B$36:$B$56,Data!$A$36:$A$56)","v":0},1E-10,74.11000000000007,74.11000000000007]
[null,null,null,null,null,74.210000000000065,{"$f":"cubspline(3,F746,Data!$B$36:$B$56,Data!$A$36:$A$56)","v":0},1E-10,74.210000000000065,74.210000000000065]
[null,null,null,null,null,74.310000000000059,{"$f":"cubspline(3,F747,Data!$B$36:$B$56,Data!$A$36:$A$56)","v":0},1E-10,74.310000000000059,74.310000000000059]
[null,null,null,null,null,74.410000000000053,{"$f":"cubspline(3,F748,Data!$B$36:$B$56,Data!$A$36:$A$56)","v":0},1E-10,74.410000000000053,74.410000000000053]
[null,null,null,null,null,74.510000000000048,{"$f":"cubspline(3,F749,Data!$B$36:$B$56,Data!$A$36:$A$56)","v":0},1E-10,74.510000000000048,74.510000000000048]
[null,null,null,null,null,74.610000000000042,{"$f":"cubspline(3,F750,Data!$B$36:$B$56,Data!$A$36:$A$56)","v":0},1E-10,74.610000000000042,74.610000000000042]
[null,null,null,null,null,74.710000000000036,{"$f":"cubspline(3,F751,Data!$B$36:$B$56,Data!$A$36:$A$56)","v":0},1E-10,74.710000000000036,74.710000000000036]
[null,null,null,null,null,74.810000000000031,{"$f":"cubspline(3,F752,Data!$B$36:$B$56,Data!$A$36:$A$56)","v":0},1E-10,74.810000000000031,74.810000000000031]
[null,null,null,null,null,74.910000000000025,{"$f":"cubspline(3,F753,Data!$B$36:$B$56,Data!$A$36:$A$56)","v":0},1E-10,74.910000000000025,74.910000000000025]
[null,null,null,null,null,75.010000000000019,{"$f":"cubspline(3,F754,Data!$B$36:$B$56,Data!$A$36:$A$56)","v":0},1E-10,75.010000000000019,75.010000000000019]
[null,null,null,null,null,75.110000000000014,{"$f":"cubspline(3,F755,Data!$B$36:$B$56,Data!$A$36:$A$56)","v":0},1E-10,75.110000000000014,75.110000000000014]
[null,null,null,null,null,75.210000000000008,{"$f":"cubspline(3,F756,Data!$B$36:$B$56,Data!$A$36:$A$56)","v":0},1E-10,75.210000000000008,75.210000000000008]
[null,null,null,null,null,75.31,{"$f":"cubspline(3,F757,Data!$B$36:$B$56,Data!$A$36:$A$56)","v":0},1E-10,75.31,75.31]
[null,null,null,null,null,75.41,{"$f":"cubspline(3,F758,Data!$B$36:$B$56,Data!$A$36:$A$56)","v":0},1E-10,75.41,75.41]
[null,null,null,null,null,75.509999999999991,{"$f":"cubspline(3,F759,Data!$B$36:$B$56,Data!$A$36:$A$56)","v":0},1E-10,75.509999999999991,75.509999999999991]
[null,null,null,null,null,75.609999999999985,{"$f":"cubspline(3,F760,Data!$B$36:$B$56,Data!$A$36:$A$56)","v":0},1E-10,75.609999999999985,75.609999999999985]
[null,null,null,null,null,75.70999999999998,{"$f":"cubspline(3,F761,Data!$B$36:$B$56,Data!$A$36:$A$56)","v":0},1E-10,75.70999999999998,75.70999999999998]
[null,null,null,null,null,75.809999999999974,{"$f":"cubspline(3,F762,Data!$B$36:$B$56,Data!$A$36:$A$56)","v":0},1E-10,75.809999999999974,75.809999999999974]
[null,null,null,null,null,75.909999999999968,{"$f":"cubspline(3,F763,Data!$B$36:$B$56,Data!$A$36:$A$56)","v":0},1E-10,75.909999999999968,75.909999999999968]
[null,null,null,null,null,76.009999999999962,{"$f":"cubspline(3,F764,Data!$B$36:$B$56,Data!$A$36:$A$56)","v":0},1E-10,76.009999999999962,76.009999999999962]
[null,null,null,null,null,76.109999999999957,{"$f":"cubspline(3,F765,Data!$B$36:$B$56,Data!$A$36:$A$56)","v":0},1E-10,76.109999999999957,76.109999999999957]
[null,null,null,null,null,76.209999999999951,{"$f":"cubspline(3,F766,Data!$B$36:$B$56,Data!$A$36:$A$56)","v":0},1E-10,76.209999999999951,76.209999999999951]
[null,null,null,null,null,76.309999999999945,{"$f":"cubspline(3,F767,Data!$B$36:$B$56,Data!$A$36:$A$56)","v":0},1E-10,76.309999999999945,76.309999999999945]
[null,null,null,null,null,76.40999999999994,{"$f":"cubspline(3,F768,Data!$B$36:$B$56,Data!$A$36:$A$56)","v":0},1E-10,76.40999999999994,76.40999999999994]
[null,null,null,null,null,76.509999999999934,{"$f":"cubspline(3,F769,Data!$B$36:$B$56,Data!$A$36:$A$56)","v":0},1E-10,76.509999999999934,76.509999999999934]
[null,null,null,null,null,76.609999999999928,{"$f":"cubspline(3,F770,Data!$B$36:$B$56,Data!$A$36:$A$56)","v":0},1E-10,76.609999999999928,76.609999999999928]
[null,null,null,null,null,76.709999999999923,{"$f":"cubspline(3,F771,Data!$B$36:$B$56,Data!$A$36:$A$56)","v":0},1E-10,76.709999999999923,76.709999999999923]
[null,null,null,null,null,76.809999999999917,{"$f":"cubspline(3,F772,Data!$B$36:$B$56,Data!$A$36:$A$56)","v":0},1E-10,76.809999999999917,76.809999999999917]
[null,null,null,null,null,76.909999999999911,{"$f":"cubspline(3,F773,Data!$B$36:$B$56,Data!$A$36:$A$56)","v":0},1E-10,{"$f":"IF(F773>$D$47,F773,NA())","v":76.909999999999911},{"$f":"IF(F773>=$D$47,F773,($D$47-(0.3*($D$47-F773))))","v":76.909999999999911}]
[null,null,null,null,null,{"$f":"F773+0.1","v":77.009999999999906},{"$f":"cubspline(3,F774,Data!$B$36:$B$56,Data!$A$36:$A$56)","v":0},{"$f":"IF(G774<=0,0.0000000001,G774)","v":1E-10},77.009999999999906,77.009999999999906]
[null,null,null,null,null,77.1099999999999,{"$f":"cubspline(3,F775,Data!$B$36:$B$56,Data!$A$36:$A$56)","v":0},1E-10,77.1099999999999,77.1099999999999]
[null,null,null,null,null,77.209999999999894,{"$f":"cubspline(3,F776,Data!$B$36:$B$56,Data!$A$36:$A$56)","v":0},1E-10,77.209999999999894,77.209999999999894]
[null,null,null,null,null,77.309999999999889,{"$f":"cubspline(3,F777,Data!$B$36:$B$56,Data!$A$36:$A$56)","v":0},1E-10,77.309999999999889,77.309999999999889]
[null,null,null,null,null,77.409999999999883,{"$f":"cubspline(3,F778,Data!$B$36:$B$56,Data!$A$36:$A$56)","v":0},1E-10,77.409999999999883,77.409999999999883]
[null,null,null,null,null,77.509999999999877,{"$f":"cubspline(3,F779,Data!$B$36:$B$56,Data!$A$36:$A$56)","v":0},1E-10,77.509999999999877,77.509999999999877]
[null,null,null,null,null,77.609999999999872,{"$f":"cubspline(3,F780,Data!$B$36:$B$56,Data!$A$36:$A$56)","v":0},1E-10,77.609999999999872,77.609999999999872]
[null,null,null,null,null,77.709999999999866,{"$f":"cubspline(3,F781,Data!$B$36:$B$56,Data!$A$36:$A$56)","v":0},1E-10,77.709999999999866,77.709999999999866]
[null,null,null,null,null,77.80999999999986,{"$f":"cubspline(3,F782,Data!$B$36:$B$56,Data!$A$36:$A$56)","v":0},1E-10,77.80999999999986,77.80999999999986]
[null,null,null,null,null,77.909999999999854,{"$f":"cubspline(3,F783,Data!$B$36:$B$56,Data!$A$36:$A$56)","v":0},1E-10,77.909999999999854,77.909999999999854]
[null,null,null,null,null,78.009999999999849,{"$f":"cubspline(3,F784,Data!$B$36:$B$56,Data!$A$36:$A$56)","v":0},1E-10,78.009999999999849,78.009999999999849]
[null,null,null,null,null,78.109999999999843,{"$f":"cubspline(3,F785,Data!$B$36:$B$56,Data!$A$36:$A$56)","v":0},1E-10,78.109999999999843,78.109999999999843]
[null,null,null,null,null,78.209999999999837,{"$f":"cubspline(3,F786,Data!$B$36:$B$56,Data!$A$36:$A$56)","v":0},1E-10,78.209999999999837,78.209999999999837]
[null,null,null,null,null,78.309999999999832,{"$f":"cubspline(3,F787,Data!$B$36:$B$56,Data!$A$36:$A$56)","v":0},1E-10,78.309999999999832,78.309999999999832]
[null,null,null,null,null,78.409999999999826,{"$f":"cubspline(3,F788,Data!$B$36:$B$56,Data!$A$36:$A$56)","v":0},1E-10,78.409999999999826,78.409999999999826]
[null,null,null,null,null,78.50999999999982,{"$f":"cubspline(3,F789,Data!$B$36:$B$56,Data!$A$36:$A$56)","v":0},1E-10,78.50999999999982,78.50999999999982]
[null,null,null,null,null,78.609999999999815,{"$f":"cubspline(3,F790,Data!$B$36:$B$56,Data!$A$36:$A$56)","v":0},1E-10,78.609999999999815,78.609999999999815]
[null,null,null,null,null,78.709999999999809,{"$f":"cubspline(3,F791,Data!$B$36:$B$56,Data!$A$36:$A$56)","v":0},1E-10,78.709999999999809,78.709999999999809]
[null,null,null,null,null,78.809999999999803,{"$f":"cubspline(3,F792,Data!$B$36:$B$56,Data!$A$36:$A$56)","v":0},1E-10,78.809999999999803,78.809999999999803]
[null,null,null,null,null,78.909999999999798,{"$f":"cubspline(3,F793,Data!$B$36:$B$56,Data!$A$36:$A$56)","v":0},1E-10,78.909999999999798,78.909999999999798]
[null,null,null,null,null,79.009999999999792,{"$f":"cubspline(3,F794,Data!$B$36:$B$56,Data!$A$36:$A$56)","v":0},1E-10,79.009999999999792,79.009999999999792]
[null,null,null,null,null,79.109999999999786,{"$f":"cubspline(3,F795,Data!$B$36:$B$56,Data!$A$36:$A$56)","v":0},1E-10,79.109999999999786,79.109999999999786]
[null,null,null,null,null,79.209999999999781,{"$f":"cubspline(3,F796,Data!$B$36:$B$56,Data!$A$36:$A$56)","v":0},1E-10,79.209999999999781,79.209999999999781]
[null,null,null,null,null,79.309999999999775,{"$f":"cubspline(3,F797,Data!$B$36:$B$56,Data!$A$36:$A$56)","v":0},1E-10,79.309999999999775,79.309999999999775]
[null,null,null,null,null,79.409999999999769,{"$f":"cubspline(3,F798,Data!$B$36:$B$56,Data!$A$36:$A$56)","v":0},1E-10,79.409999999999769,79.409999999999769]
[null,null,null,null,null,79.509999999999764,{"$f":"cubspline(3,F799,Data!$B$36:$B$56,Data!$A$36:$A$56)","v":0},1E-10,79.509999999999764,79.509999999999764]
[null,null,null,null,null,79.609999999999758,{"$f":"cubspline(3,F800,Data!$B$36:$B$56,Data!$A$36:$A$56)","v":0},1E-10,79.609999999999758,79.609999999999758]
[null,null,null,null,null,79.709999999999752,{"$f":"cubspline(3,F801,Data!$B$36:$B$56,Data!$A$36:$A$56)","v":0},1E-10,79.709999999999752,79.709999999999752]
[null,null,null,null,null,79.809999999999746,{"$f":"cubspline(3,F802,Data!$B$36:$B$56,Data!$A$36:$A$56)","v":0},1E-10,79.809999999999746,79.809999999999746]
[null,null,null,null,null,79.909999999999741,{"$f":"cubspline(3,F803,Data!$B$36:$B$56,Data!$A$36:$A$56)","v":0},1E-10,79.909999999999741,79.909999999999741]
[null,null,null,null,null,80.009999999999735,{"$f":"cubspline(3,F804,Data!$B$36:$B$56,Data!$A$36:$A$56)","v":0},1E-10,80.009999999999735,80.009999999999735]
[null,null,null,null,null,80.109999999999729,{"$f":"cubspline(3,F805,Data!$B$36:$B$56,Data!$A$36:$A$56)","v":0},1E-10,80.109999999999729,80.109999999999729]
[null,null,null,null,null,80.209999999999724,{"$f":"cubspline(3,F806,Data!$B$36:$B$56,Data!$A$36:$A$56)","v":0},1E-10,80.209999999999724,80.209999999999724]
[null,null,null,null,null,80.309999999999718,{"$f":"cubspline(3,F807,Data!$B$36:$B$56,Data!$A$36:$A$56)","v":0},1E-10,80.309999999999718,80.309999999999718]
[null,null,null,null,null,80.409999999999712,{"$f":"cubspline(3,F808,Data!$B$36:$B$56,Data!$A$36:$A$56)","v":0},1E-10,80.409999999999712,80.409999999999712]
[null,null,null,null,null,80.509999999999707,{"$f":"cubspline(3,F809,Data!$B$36:$B$56,Data!$A$36:$A$56)","v":0},1E-10,80.509999999999707,80.509999999999707]
[null,null,null,null,null,80.609999999999701,{"$f":"cubspline(3,F810,Data!$B$36:$B$56,Data!$A$36:$A$56)","v":0},1E-10,80.609999999999701,80.609999999999701]
[null,null,null,null,null,80.709999999999695,{"$f":"cubspline(3,F811,Data!$B$36:$B$56,Data!$A$36:$A$56)","v":0},1E-10,80.709999999999695,80.709999999999695]
[null,null,null,null,null,80.80999999999969,{"$f":"cubspline(3,F812,Data!$B$36:$B$56,Data!$A$36:$A$56)","v":0},1E-10,80.80999999999969,80.80999999999969]
[null,null,null,null,null,80.909999999999684,{"$f":"cubspline(3,F813,Data!$B$36:$B$56,Data!$A$36:$A$56)","v":0},1E-10,80.909999999999684,80.909999999999684]
[null,null,null,null,null,81.009999999999678,{"$f":"cubspline(3,F814,Data!$B$36:$B$56,Data!$A$36:$A$56)","v":0},1E-10,81.009999999999678,81.009999999999678]
[null,null,null,null,null,81.109999999999673,{"$f":"cubspline(3,F815,Data!$B$36:$B$56,Data!$A$36:$A$56)","v":0},1E-10,81.109999999999673,81.109999999999673]
[null,null,null,null,null,81.209999999999667,{"$f":"cubspline(3,F816,Data!$B$36:$B$56,Data!$A$36:$A$56)","v":0},1E-10,81.209999999999667,81.209999999999667]
[null,null,null,null,null,81.309999999999661,{"$f":"cubspline(3,F817,Data!$B$36:$B$56,Data!$A$36:$A$56)","v":0},1E-10,81.309999999999661,81.309999999999661]
[null,null,null,null,null,81.409999999999656,{"$f":"cubspline(3,F818,Data!$B$36:$B$56,Data!$A$36:$A$56)","v":0},1E-10,81.409999999999656,81.409999999999656]
[null,null,null,null,null,81.50999999999965,{"$f":"cubspline(3,F819,Data!$B$36:$B$56,Data!$A$36:$A$56)","v":0},1E-10,81.50999999999965,81.50999999999965]
[null,null,null,null,null,81.609999999999644,{"$f":"cubspline(3,F820,Data!$B$36:$B$56,Data!$A$36:$A$56)","v":0},1E-10,81.609999999999644,81.609999999999644]
[null,null,null,null,null,81.709999999999638,{"$f":"cubspline(3,F821,Data!$B$36:$B$56,Data!$A$36:$A$56)","v":0},1E-10,81.709999999999638,81.709999999999638]
[null,null,null,null,null,81.809999999999633,{"$f":"cubspline(3,F822,Data!$B$36:$B$56,Data!$A$36:$A$56)","v":0},1E-10,81.809999999999633,81.809999999999633]
[null,null,null,null,null,81.909999999999627,{"$f":"cubspline(3,F823,Data!$B$36:$B$56,Data!$A$36:$A$56)","v":0},1E-10,81.909999999999627,81.909999999999627]
[null,null,null,null,null,82.009999999999621,{"$f":"cubspline(3,F824,Data!$B$36:$B$56,Data!$A$36:$A$56)","v":0},1E-10,82.009999999999621,82.009999999999621]
[null,null,null,null,null,82.109999999999616,{"$f":"cubspline(3,F825,Data!$B$36:$B$56,Data!$A$36:$A$56)","v":0},1E-10,82.109999999999616,82.109999999999616]
[null,null,null,null,null,82.20999999999961,{"$f":"cubspline(3,F826,Data!$B$36:$B$56,Data!$A$36:$A$56)","v":0},1E-10,82.20999999999961,82.20999999999961]
[null,null,null,null,null,82.309999999999604,{"$f":"cubspline(3,F827,Data!$B$36:$B$56,Data!$A$36:$A$56)","v":0},1E-10,82.309999999999604,82.309999999999604]
[null,null,null,null,null,82.409999999999599,{"$f":"cubspline(3,F828,Data!$B$36:$B$56,Data!$A$36:$A$56)","v":0},1E-10,82.409999999999599,82.409999999999599]
[null,null,null,null,null,82.509999999999593,{"$f":"cubspline(3,F829,Data!$B$36:$B$56,Data!$A$36:$A$56)","v":0},1E-10,82.509999999999593,82.509999999999593]
[null,null,null,null,null,82.609999999999587,{"$f":"cubspline(3,F830,Data!$B$36:$B$56,Data!$A$36:$A$56)","v":0},1E-10,82.609999999999587,82.609999999999587]
[null,null,null,null,null,82.709999999999582,{"$f":"cubspline(3,F831,Data!$B$36:$B$56,Data!$A$36:$A$56)","v":0},1E-10,82.709999999999582,82.709999999999582]
[null,null,null,null,null,82.809999999999576,{"$f":"cubspline(3,F832,Data!$B$36:$B$56,Data!$A$36:$A$56)","v":0},1E-10,82.809999999999576,82.809999999999576]
[null,null,null,null,null,82.90999999999957,{"$f":"cubspline(3,F833,Data!$B$36:$B$56,Data!$A$36:$A$56)","v":0},1E-10,82.90999999999957,82.90999999999957]
[null,null,null,null,null,83.009999999999565,{"$f":"cubspline(3,F834,Data!$B$36:$B$56,Data!$A$36:$A$56)","v":0},1E-10,83.009999999999565,83.009999999999565]
[null,null,null,null,null,83.109999999999559,{"$f":"cubspline(3,F835,Data!$B$36:$B$56,Data!$A$36:$A$56)","v":0},1E-10,83.109999999999559,83.109999999999559]
[null,null,null,null,null,83.209999999999553,{"$f":"cubspline(3,F836,Data!$B$36:$B$56,Data!$A$36:$A$56)","v":0},1E-10,83.209999999999553,83.209999999999553]
[null,null,null,null,null,83.309999999999548,{"$f":"cubspline(3,F837,Data!$B$36:$B$56,Data!$A$36:$A$56)","v":0},1E-10,{"$f":"IF(F837>$D$47,F837,NA())","v":83.309999999999548},{"$f":"IF(F837>=$D$47,F837,($D$47-(0.3*($D$47-F837))))","v":83.309999999999548}]
[null,null,null,null,null,{"$f":"F837+0.1","v":83.409999999999542},{"$f":"cubspline(3,F838,Data!$B$36:$B$56,Data!$A$36:$A$56)","v":0},{"$f":"IF(G838<=0,0.0000000001,G838)","v":1E-10},83.409999999999542,83.409999999999542]
[null,null,null,null,null,83.509999999999536,{"$f":"cubspline(3,F839,Data!$B$36:$B$56,Data!$A$36:$A$56)","v":0},1E-10,83.509999999999536,83.509999999999536]
[null,null,null,null,null,83.60999999999953,{"$f":"cubspline(3,F840,Data!$B$36:$B$56,Data!$A$36:$A$56)","v":0},1E-10,83.60999999999953,83.60999999999953]
[null,null,null,null,null,83.709999999999525,{"$f":"cubspline(3,F841,Data!$B$36:$B$56,Data!$A$36:$A$56)","v":0},1E-10,83.709999999999525,83.709999999999525]
[null,null,null,null,null,83.809999999999519,{"$f":"cubspline(3,F842,Data!$B$36:$B$56,Data!$A$36:$A$56)","v":0},1E-10,83.809999999999519,83.809999999999519]
[null,null,null,null,null,83.909999999999513,{"$f":"cubspline(3,F843,Data!$B$36:$B$56,Data!$A$36:$A$56)","v":0},1E-10,83.909999999999513,83.909999999999513]
[null,null,null,null,null,84.009999999999508,{"$f":"cubspline(3,F844,Data!$B$36:$B$56,Data!$A$36:$A$56)","v":0},1E-10,84.009999999999508,84.009999999999508]
[null,null,null,null,null,84.109999999999502,{"$f":"cubspline(3,F845,Data!$B$36:$B$56,Data!$A$36:$A$56)","v":0},1E-10,84.109999999999502,84.109999999999502]
[null,null,null,null,null,84.209999999999496,{"$f":"cubspline(3,F846,Data!$B$36:$B$56,Data!$A$36:$A$56)","v":0},1E-10,84.209999999999496,84.209999999999496]
[null,null,null,null,null,84.309999999999491,{"$f":"cubspline(3,F847,Data!$B$36:$B$56,Data!$A$36:$A$56)","v":0},1E-10,84.309999999999491,84.309999999999491]
[null,null,null,null,null,84.409999999999485,{"$f":"cubspline(3,F848,Data!$B$36:$B$56,Data!$A$36:$A$56)","v":0},1E-10,84.409999999999485,84.409999999999485]
[null,null,null,null,null,84.509999999999479,{"$f":"cubspline(3,F849,Data!$B$36:$B$56,Data!$A$36:$A$56)","v":0},1E-10,84.509999999999479,84.509999999999479]
[null,null,null,null,null,84.609999999999474,{"$f":"cubspline(3,F850,Data!$B$36:$B$56,Data!$A$36:$A$56)","v":0},1E-10,84.609999999999474,84.609999999999474]
[null,null,null,null,null,84.709999999999468,{"$f":"cubspline(3,F851,Data!$B$36:$B$56,Data!$A$36:$A$56)","v":0},1E-10,84.709999999999468,84.709999999999468]
[null,null,null,null,null,84.809999999999462,{"$f":"cubspline(3,F852,Data!$B$36:$B$56,Data!$A$36:$A$56)","v":0},1E-10,84.809999999999462,84.809999999999462]
[null,null,null,null,null,84.909999999999457,{"$f":"cubspline(3,F853,Data!$B$36:$B$56,Data!$A$36:$A$56)","v":0},1E-10,84.909999999999457,84.909999999999457]
[null,null,null,null,null,85.009999999999451,{"$f":"cubspline(3,F854,Data!$B$36:$B$56,Data!$A$36:$A$56)","v":0},1E-10,85.009999999999451,85.009999999999451]
[null,null,null,null,null,85.109999999999445,{"$f":"cubspline(3,F855,Data!$B$36:$B$56,Data!$A$36:$A$56)","v":0},1E-10,85.109999999999445,85.109999999999445]
[null,null,null,null,null,85.20999999999944,{"$f":"cubspline(3,F856,Data!$B$36:$B$56,Data!$A$36:$A$56)","v":0},1E-10,85.20999999999944,85.20999999999944]
[null,null,null,null,null,85.309999999999434,{"$f":"cubspline(3,F857,Data!$B$36:$B$56,Data!$A$36:$A$56)","v":0},1E-10,85.309999999999434,85.309999999999434]
[null,null,null,null,null,85.409999999999428,{"$f":"cubspline(3,F858,Data!$B$36:$B$56,Data!$A$36:$A$56)","v":0},1E-10,85.409999999999428,85.409999999999428]
[null,null,null,null,null,85.509999999999422,{"$f":"cubspline(3,F859,Data!$B$36:$B$56,Data!$A$36:$A$56)","v":0},1E-10,85.509999999999422,85.509999999999422]
[null,null,null,null,null,85.609999999999417,{"$f":"cubspline(3,F860,Data!$B$36:$B$56,Data!$A$36:$A$56)","v":0},1E-10,85.609999999999417,85.609999999999417]
[null,null,null,null,null,85.709999999999411,{"$f":"cubspline(3,F861,Data!$B$36:$B$56,Data!$A$36:$A$56)","v":0},1E-10,85.709999999999411,85.709999999999411]
[null,null,null,null,null,85.809999999999405,{"$f":"cubspline(3,F862,Data!$B$36:$B$56,Data!$A$36:$A$56)","v":0},1E-10,85.809999999999405,85.809999999999405]
[null,null,null,null,null,85.9099999999994,{"$f":"cubspline(3,F863,Data!$B$36:$B$56,Data!$A$36:$A$56)","v":0},1E-10,85.9099999999994,85.9099999999994]
[null,null,null,null,null,86.009999999999394,{"$f":"cubspline(3,F864,Data!$B$36:$B$56,Data!$A$36:$A$56)","v":0},1E-10,86.009999999999394,86.009999999999394]
[null,null,null,null,null,86.109999999999388,{"$f":"cubspline(3,F865,Data!$B$36:$B$56,Data!$A$36:$A$56)","v":0},1E-10,86.109999999999388,86.109999999999388]
[null,null,null,null,null,86.209999999999383,{"$f":"cubspline(3,F866,Data!$B$36:$B$56,Data!$A$36:$A$56)","v":0},1E-10,86.209999999999383,86.209999999999383]
[null,null,null,null,null,86.309999999999377,{"$f":"cubspline(3,F867,Data!$B$36:$B$56,Data!$A$36:$A$56)","v":0},1E-10,86.309999999999377,86.309999999999377]
[null,null,null,null,null,86.409999999999371,{"$f":"cubspline(3,F868,Data!$B$36:$B$56,Data!$A$36:$A$56)","v":0},1E-10,86.409999999999371,86.409999999999371]
[null,null,null,null,null,86.509999999999366,{"$f":"cubspline(3,F869,Data!$B$36:$B$56,Data!$A$36:$A$56)","v":0},1E-10,86.509999999999366,86.509999999999366]
[null,null,null,null,null,86.60999999999936,{"$f":"cubspline(3,F870,Data!$B$36:$B$56,Data!$A$36:$A$56)","v":0},1E-10,86.60999999999936,86.60999999999936]
[null,null,null,null,null,86.709999999999354,{"$f":"cubspline(3,F871,Data!$B$36:$B$56,Data!$A$36:$A$56)","v":0},1E-10,86.709999999999354,86.709999999999354]
[null,null,null,null,null,86.809999999999349,{"$f":"cubspline(3,F872,Data!$B$36:$B$56,Data!$A$36:$A$56)","v":0},1E-10,86.809999999999349,86.809999999999349]
[null,null,null,null,null,86.909999999999343,{"$f":"cubspline(3,F873,Data!$B$36:$B$56,Data!$A$36:$A$56)","v":0},1E-10,86.909999999999343,86.909999999999343]
[null,null,null,null,null,87.009999999999337,{"$f":"cubspline(3,F874,Data!$B$36:$B$56,Data!$A$36:$A$56)","v":0},1E-10,87.009999999999337,87.009999999999337]
[null,null,null,null,null,87.109999999999332,{"$f":"cubspline(3,F875,Data!$B$36:$B$56,Data!$A$36:$A$56)","v":0},1E-10,87.109999999999332,87.109999999999332]
[null,null,null,null,null,87.209999999999326,{"$f":"cubspline(3,F876,Data!$B$36:$B$56,Data!$A$36:$A$56)","v":0},1E-10,87.209999999999326,87.209999999999326]
[null,null,null,null,null,87.30999999999932,{"$f":"cubspline(3,F877,Data!$B$36:$B$56,Data!$A$36:$A$56)","v":0},1E-10,87.30999999999932,87.30999999999932]
[null,null,null,null,null,87.409999999999314,{"$f":"cubspline(3,F878,Data!$B$36:$B$56,Data!$A$36:$A$56)","v":0},1E-10,87.409999999999314,87.409999999999314]
[null,null,null,null,null,87.509999999999309,{"$f":"cubspline(3,F879,Data!$B$36:$B$56,Data!$A$36:$A$56)","v":0},1E-10,87.509999999999309,87.509999999999309]
[null,null,null,null,null,87.609999999999303,{"$f":"cubspline(3,F880,Data!$B$36:$B$56,Data!$A$36:$A$56)","v":0},1E-10,87.609999999999303,87.609999999999303]
[null,null,null,null,null,87.709999999999297,{"$f":"cubspline(3,F881,Data!$B$36:$B$56,Data!$A$36:$A$56)","v":0},1E-10,87.709999999999297,87.709999999999297]
[null,null,null,null,null,87.809999999999292,{"$f":"cubspline(3,F882,Data!$B$36:$B$56,Data!$A$36:$A$56)","v":0},1E-10,87.809999999999292,87.809999999999292]
[null,null,null,null,null,87.909999999999286,{"$f":"cubspline(3,F883,Data!$B$36:$B$56,Data!$A$36:$A$56)","v":0},1E-10,87.909999999999286,87.909999999999286]
[null,null,null,null,null,88.00999999999928,{"$f":"cubspline(3,F884,Data!$B$36:$B$56,Data!$A$36:$A$56)","v":0},1E-10,88.00999999999928,88.00999999999928]
[null,null,null,null,null,88.109999999999275,{"$f":"cubspline(3,F885,Data!$B$36:$B$56,Data!$A$36:$A$56)","v":0},1E-10,88.109999999999275,88.109999999999275]
[null,null,null,null,null,88.209999999999269,{"$f":"cubspline(3,F886,Data!$B$36:$B$56,Data!$A$36:$A$56)","v":0},1E-10,88.209999999999269,88.209999999999269]
[null,null,null,null,null,88.309999999999263,{"$f":"cubspline(3,F887,Data!$B$36:$B$56,Data!$A$36:$A$56)","v":0},1E-10,88.309999999999263,88.309999999999263]
[null,null,null,null,null,88.409999999999258,{"$f":"cubspline(3,F888,Data!$B$36:$B$56,Data!$A$36:$A$56)","v":0},1E-10,88.409999999999258,88.409999999999258]
[null,null,null,null,null,88.509999999999252,{"$f":"cubspline(3,F889,Data!$B$36:$B$56,Data!$A$36:$A$56)","v":0},1E-10,88.509999999999252,88.509999999999252]
[null,null,null,null,null,88.609999999999246,{"$f":"cubspline(3,F890,Data!$B$36:$B$56,Data!$A$36:$A$56)","v":0},1E-10,88.609999999999246,88.609999999999246]
[null,null,null,null,null,88.709999999999241,{"$f":"cubspline(3,F891,Data!$B$36:$B$56,Data!$A$36:$A$56)","v":0},1E-10,88.709999999999241,88.709999999999241]
[null,null,null,null,null,88.809999999999235,{"$f":"cubspline(3,F892,Data!$B$36:$B$56,Data!$A$36:$A$56)","v":0},1E-10,88.809999999999235,88.809999999999235]
[null,null,null,null,null,88.909999999999229,{"$f":"cubspline(3,F893,Data!$B$36:$B$56,Data!$A$36:$A$56)","v":0},1E-10,88.909999999999229,88.909999999999229]
[null,null,null,null,null,89.009999999999224,{"$f":"cubspline(3,F894,Data!$B$36:$B$56,Data!$A$36:$A$56)","v":0},1E-10,89.009999999999224,89.009999999999224]
[null,null,null,null,null,89.109999999999218,{"$f":"cubspline(3,F895,Data!$B$36:$B$56,Data!$A$36:$A$56)","v":0},1E-10,89.109999999999218,89.109999999999218]
[null,null,null,null,null,89.209999999999212,{"$f":"cubspline(3,F896,Data!$B$36:$B$56,Data!$A$36:$A$56)","v":0},1E-10,89.209999999999212,89.209999999999212]
[null,null,null,null,null,89.309999999999206,{"$f":"cubspline(3,F897,Data!$B$36:$B$56,Data!$A$36:$A$56)","v":0},1E-10,89.309999999999206,89.309999999999206]
[null,null,null,null,null,89.409999999999201,{"$f":"cubspline(3,F898,Data!$B$36:$B$56,Data!$A$36:$A$56)","v":0},1E-10,89.409999999999201,89.409999999999201]
[null,null,null,null,null,89.509999999999195,{"$f":"cubspline(3,F899,Data!$B$36:$B$56,Data!$A$36:$A$56)","v":0},1E-10,89.509999999999195,89.509999999999195]
[null,null,null,null,null,89.609999999999189,{"$f":"cubspline(3,F900,Data!$B$36:$B$56,Data!$A$36:$A$56)","v":0},1E-10,89.609999999999189,89.609999999999189]
[null,null,null,null,null,89.709999999999184,{"$f":"cubspline(3,F901,Data!$B$36:$B$56,Data!$A$36:$A$56)","v":0},1E-10,{"$f":"IF(F901>$D$47,F901,NA())","v":89.709999999999184},{"$f":"IF(F901>=$D$47,F901,($D$47-(0.3*($D$47-F901))))","v":89.709999999999184}]
[null,null,null,null,null,{"$f":"F901+0.1","v":89.809999999999178},{"$f":"cubspline(3,F902,Data!$B$36:$B$56,Data!$A$36:$A$56)","v":0},{"$f":"IF(G902<=0,0.0000000001,G902)","v":1E-10},89.809999999999178,89.809999999999178]
[null,null,null,null,null,89.909999999999172,{"$f":"cubspline(3,F903,Data!$B$36:$B$56,Data!$A$36:$A$56)","v":0},1E-10,89.909999999999172,89.909999999999172]
[null,null,null,null,null,90.009999999999167,{"$f":"cubspline(3,F904,Data!$B$36:$B$56,Data!$A$36:$A$56)","v":0},1E-10,90.009999999999167,90.009999999999167]
[null,null,null,null,null,90.109999999999161,{"$f":"cubspline(3,F905,Data!$B$36:$B$56,Data!$A$36:$A$56)","v":0},1E-10,90.109999999999161,90.109999999999161]
[null,null,null,null,null,90.209999999999155,{"$f":"cubspline(3,F906,Data!$B$36:$B$56,Data!$A$36:$A$56)","v":0},1E-10,90.209999999999155,90.209999999999155]
[null,null,null,null,null,90.30999999999915,{"$f":"cubspline(3,F907,Data!$B$36:$B$56,Data!$A$36:$A$56)","v":0},1E-10,90.30999999999915,90.30999999999915]
[null,null,null,null,null,90.409999999999144,{"$f":"cubspline(3,F908,Data!$B$36:$B$56,Data!$A$36:$A$56)","v":0},1E-10,90.409999999999144,90.409999999999144]
[null,null,null,null,null,90.509999999999138,{"$f":"cubspline(3,F909,Data!$B$36:$B$56,Data!$A$36:$A$56)","v":0},1E-10,90.509999999999138,90.509999999999138]
[null,null,null,null,null,90.609999999999133,{"$f":"cubspline(3,F910,Data!$B$36:$B$56,Data!$A$36:$A$56)","v":0},1E-10,90.609999999999133,90.609999999999133]
[null,null,null,null,null,90.709999999999127,{"$f":"cubspline(3,F911,Data!$B$36:$B$56,Data!$A$36:$A$56)","v":0},1E-10,90.709999999999127,90.709999999999127]
[null,null,null,null,null,90.809999999999121,{"$f":"cubspline(3,F912,Data!$B$36:$B$56,Data!$A$36:$A$56)","v":0},1E-10,90.809999999999121,90.809999999999121]
[null,null,null,null,null,90.909999999999116,{"$f":"cubspline(3,F913,Data!$B$36:$B$56,Data!$A$36:$A$56)","v":0},1E-10,90.909999999999116,90.909999999999116]
[null,null,null,null,null,91.00999999999911,{"$f":"cubspline(3,F914,Data!$B$36:$B$56,Data!$A$36:$A$56)","v":0},1E-10,91.00999999999911,91.00999999999911]
[null,null,null,null,null,91.109999999999104,{"$f":"cubspline(3,F915,Data!$B$36:$B$56,Data!$A$36:$A$56)","v":0},1E-10,91.109999999999104,91.109999999999104]
[null,null,null,null,null,91.209999999999098,{"$f":"cubspline(3,F916,Data!$B$36:$B$56,Data!$A$36:$A$56)","v":0},1E-10,91.209999999999098,91.209999999999098]
[null,null,null,null,null,91.309999999999093,{"$f":"cubspline(3,F917,Data!$B$36:$B$56,Data!$A$36:$A$56)","v":0},1E-10,91.309999999999093,91.309999999999093]
[null,null,null,null,null,91.409999999999087,{"$f":"cubspline(3,F918,Data!$B$36:$B$56,Data!$A$36:$A$56)","v":0},1E-10,91.409999999999087,91.409999999999087]
[null,null,null,null,null,91.509999999999081,{"$f":"cubspline(3,F919,Data!$B$36:$B$56,Data!$A$36:$A$56)","v":0},1E-10,91.509999999999081,91.509999999999081]
[null,null,null,null,null,91.609999999999076,{"$f":"cubspline(3,F920,Data!$B$36:$B$56,Data!$A$36:$A$56)","v":0},1E-10,91.609999999999076,91.609999999999076]
[null,null,null,null,null,91.70999999999907,{"$f":"cubspline(3,F921,Data!$B$36:$B$56,Data!$A$36:$A$56)","v":0},1E-10,91.70999999999907,91.70999999999907]
[null,null,null,null,null,91.809999999999064,{"$f":"cubspline(3,F922,Data!$B$36:$B$56,Data!$A$36:$A$56)","v":0},1E-10,91.809999999999064,91.809999999999064]
[null,null,null,null,null,91.909999999999059,{"$f":"cubspline(3,F923,Data!$B$36:$B$56,Data!$A$36:$A$56)","v":0},1E-10,91.909999999999059,91.909999999999059]
[null,null,null,null,null,92.009999999999053,{"$f":"cubspline(3,F924,Data!$B$36:$B$56,Data!$A$36:$A$56)","v":0},1E-10,92.009999999999053,92.009999999999053]
[null,null,null,null,null,92.109999999999047,{"$f":"cubspline(3,F925,Data!$B$36:$B$56,Data!$A$36:$A$56)","v":0},1E-10,92.109999999999047,92.109999999999047]
[null,null,null,null,null,92.209999999999042,{"$f":"cubspline(3,F926,Data!$B$36:$B$56,Data!$A$36:$A$56)","v":0},1E-10,92.209999999999042,92.209999999999042]
[null,null,null,null,null,92.309999999999036,{"$f":"cubspline(3,F927,Data!$B$36:$B$56,Data!$A$36:$A$56)","v":0},1E-10,92.309999999999036,92.309999999999036]
[null,null,null,null,null,92.40999999999903,{"$f":"cubspline(3,F928,Data!$B$36:$B$56,Data!$A$36:$A$56)","v":0},1E-10,92.40999999999903,92.40999999999903]
[null,null,null,null,null,92.509999999999025,{"$f":"cubspline(3,F929,Data!$B$36:$B$56,Data!$A$36:$A$56)","v":0},1E-10,92.509999999999025,92.509999999999025]
[null,null,null,null,null,92.609999999999019,{"$f":"cubspline(3,F930,Data!$B$36:$B$56,Data!$A$36:$A$56)","v":0},1E-10,92.609999999999019,92.609999999999019]
[null,null,null,null,null,92.709999999999013,{"$f":"cubspline(3,F931,Data!$B$36:$B$56,Data!$A$36:$A$56)","v":0},1E-10,92.709999999999013,92.709999999999013]
[null,null,null,null,null,92.809999999999008,{"$f":"cubspline(3,F932,Data!$B$36:$B$56,Data!$A$36:$A$56)","v":0},1E-10,92.809999999999008,92.809999999999008]
[null,null,null,null,null,92.909999999999002,{"$f":"cubspline(3,F933,Data!$B$36:$B$56,Data!$A$36:$A$56)","v":0},1E-10,92.909999999999002,92.909999999999002]
[null,null,null,null,null,93.009999999998996,{"$f":"cubspline(3,F934,Data!$B$36:$B$56,Data!$A$36:$A$56)","v":0},1E-10,93.009999999998996,93.009999999998996]
[null,null,null,null,null,93.10999999999899,{"$f":"cubspline(3,F935,Data!$B$36:$B$56,Data!$A$36:$A$56)","v":0},1E-10,93.10999999999899,93.10999999999899]
[null,null,null,null,null,93.209999999998985,{"$f":"cubspline(3,F936,Data!$B$36:$B$56,Data!$A$36:$A$56)","v":0},1E-10,93.209999999998985,93.209999999998985]
[null,null,null,null,null,93.309999999998979,{"$f":"cubspline(3,F937,Data!$B$36:$B$56,Data!$A$36:$A$56)","v":0},1E-10,93.309999999998979,93.309999999998979]
[null,null,null,null,null,93.409999999998973,{"$f":"cubspline(3,F938,Data!$B$36:$B$56,Data!$A$36:$A$56)","v":0},1E-10,93.409999999998973,93.409999999998973]
[null,null,null,null,null,93.509999999998968,{"$f":"cubspline(3,F939,Data!$B$36:$B$56,Data!$A$36:$A$56)","v":0},1E-10,93.509999999998968,93.509999999998968]
[null,null,null,null,null,93.609999999998962,{"$f":"cubspline(3,F940,Data!$B$36:$B$56,Data!$A$36:$A$56)","v":0},1E-10,93.609999999998962,93.609999999998962]
[null,null,null,null,null,93.709999999998956,{"$f":"cubspline(3,F941,Data!$B$36:$B$56,Data!$A$36:$A$56)","v":0},1E-10,93.709999999998956,93.709999999998956]
[null,null,null,null,null,93.809999999998951,{"$f":"cubspline(3,F942,Data!$B$36:$B$56,Data!$A$36:$A$56)","v":0},1E-10,93.809999999998951,93.809999999998951]
[null,null,null,null,null,93.909999999998945,{"$f":"cubspline(3,F943,Data!$B$36:$B$56,Data!$A$36:$A$56)","v":0},1E-10,93.909999999998945,93.909999999998945]
[null,null,null,null,null,94.009999999998939,{"$f":"cubspline(3,F944,Data!$B$36:$B$56,Data!$A$36:$A$56)","v":0},1E-10,94.009999999998939,94.009999999998939]
[null,null,null,null,null,94.109999999998934,{"$f":"cubspline(3,F945,Data!$B$36:$B$56,Data!$A$36:$A$56)","v":0},1E-10,94.109999999998934,94.109999999998934]
[null,null,null,null,null,94.209999999998928,{"$f":"cubspline(3,F946,Data!$B$36:$B$56,Data!$A$36:$A$56)","v":0},1E-10,94.209999999998928,94.209999999998928]
[null,null,null,null,null,94.309999999998922,{"$f":"cubspline(3,F947,Data!$B$36:$B$56,Data!$A$36:$A$56)","v":0},1E-10,94.309999999998922,94.309999999998922]
[null,null,null,null,null,94.409999999998917,{"$f":"cubspline(3,F948,Data!$B$36:$B$56,Data!$A$36:$A$56)","v":0},1E-10,94.409999999998917,94.409999999998917]
[null,null,null,null,null,94.509999999998911,{"$f":"cubspline(3,F949,Data!$B$36:$B$56,Data!$A$36:$A$56)","v":0},1E-10,94.509999999998911,94.509999999998911]
[null,null,null,null,null,94.609999999998905,{"$f":"cubspline(3,F950,Data!$B$36:$B$56,Data!$A$36:$A$56)","v":0},1E-10,94.609999999998905,94.609999999998905]
[null,null,null,null,null,94.7099999999989,{"$f":"cubspline(3,F951,Data!$B$36:$B$56,Data!$A$36:$A$56)","v":0},1E-10,94.7099999999989,94.7099999999989]
[null,null,null,null,null,94.809999999998894,{"$f":"cubspline(3,F952,Data!$B$36:$B$56,Data!$A$36:$A$56)","v":0},1E-10,94.809999999998894,94.809999999998894]
[null,null,null,null,null,94.909999999998888,{"$f":"cubspline(3,F953,Data!$B$36:$B$56,Data!$A$36:$A$56)","v":0},1E-10,94.909999999998888,94.909999999998888]
[null,null,null,null,null,95.009999999998882,{"$f":"cubspline(3,F954,Data!$B$36:$B$56,Data!$A$36:$A$56)","v":0},1E-10,95.009999999998882,95.009999999998882]
[null,null,null,null,null,95.109999999998877,{"$f":"cubspline(3,F955,Data!$B$36:$B$56,Data!$A$36:$A$56)","v":0},1E-10,95.109999999998877,95.109999999998877]
[null,null,null,null,null,95.209999999998871,{"$f":"cubspline(3,F956,Data!$B$36:$B$56,Data!$A$36:$A$56)","v":0},1E-10,95.209999999998871,95.209999999998871]
[null,null,null,null,null,95.309999999998865,{"$f":"cubspline(3,F957,Data!$B$36:$B$56,Data!$A$36:$A$56)","v":0},1E-10,95.309999999998865,95.309999999998865]
[null,null,null,null,null,95.40999999999886,{"$f":"cubspline(3,F958,Data!$B$36:$B$56,Data!$A$36:$A$56)","v":0},1E-10,95.40999999999886,95.40999999999886]
[null,null,null,null,null,95.509999999998854,{"$f":"cubspline(3,F959,Data!$B$36:$B$56,Data!$A$36:$A$56)","v":0},1E-10,95.509999999998854,95.509999999998854]
[null,null,null,null,null,95.609999999998848,{"$f":"cubspline(3,F960,Data!$B$36:$B$56,Data!$A$36:$A$56)","v":0},1E-10,95.609999999998848,95.609999999998848]
[null,null,null,null,null,95.709999999998843,{"$f":"cubspline(3,F961,Data!$B$36:$B$56,Data!$A$36:$A$56)","v":0},1E-10,95.709999999998843,95.709999999998843]
[null,null,null,null,null,95.809999999998837,{"$f":"cubspline(3,F962,Data!$B$36:$B$56,Data!$A$36:$A$56)","v":0},1E-10,95.809999999998837,95.809999999998837]
[null,null,null,null,null,95.909999999998831,{"$f":"cubspline(3,F963,Data!$B$36:$B$56,Data!$A$36:$A$56)","v":0},1E-10,95.909999999998831,95.909999999998831]
[null,null,null,null,null,96.009999999998826,{"$f":"cubspline(3,F964,Data!$B$36:$B$56,Data!$A$36:$A$56)","v":0},1E-10,96.009999999998826,96.009999999998826]
[null,null,null,null,null,96.10999999999882,{"$f":"cubspline(3,F965,Data!$B$36:$B$56,Data!$A$36:$A$56)","v":0},1E-10,{"$f":"IF(F965>$D$47,F965,NA())","v":96.10999999999882},{"$f":"IF(F965>=$D$47,F965,($D$47-(0.3*($D$47-F965))))","v":96.10999999999882}]
[null,null,null,null,null,{"$f":"F965+0.1","v":96.209999999998814},{"$f":"cubspline(3,F966,Data!$B$36:$B$56,Data!$A$36:$A$56)","v":0},{"$f":"IF(G966<=0,0.0000000001,G966)","v":1E-10},96.209999999998814,96.209999999998814]
[null,null,null,null,null,96.309999999998809,{"$f":"cubspline(3,F967,Data!$B$36:$B$56,Data!$A$36:$A$56)","v":0},1E-10,96.309999999998809,96.309999999998809]
[null,null,null,null,null,96.409999999998803,{"$f":"cubspline(3,F968,Data!$B$36:$B$56,Data!$A$36:$A$56)","v":0},1E-10,96.409999999998803,96.409999999998803]
[null,null,null,null,null,96.509999999998797,{"$f":"cubspline(3,F969,Data!$B$36:$B$56,Data!$A$36:$A$56)","v":0},1E-10,96.509999999998797,96.509999999998797]
[null,null,null,null,null,96.609999999998792,{"$f":"cubspline(3,F970,Data!$B$36:$B$56,Data!$A$36:$A$56)","v":0},1E-10,96.609999999998792,96.609999999998792]
[null,null,null,null,null,96.709999999998786,{"$f":"cubspline(3,F971,Data!$B$36:$B$56,Data!$A$36:$A$56)","v":0},1E-10,96.709999999998786,96.709999999998786]
[null,null,null,null,null,96.80999999999878,{"$f":"cubspline(3,F972,Data!$B$36:$B$56,Data!$A$36:$A$56)","v":0},1E-10,96.80999999999878,96.80999999999878]
[null,null,null,null,null,96.909999999998774,{"$f":"cubspline(3,F973,Data!$B$36:$B$56,Data!$A$36:$A$56)","v":0},1E-10,96.909999999998774,96.909999999998774]
[null,null,null,null,null,97.009999999998769,{"$f":"cubspline(3,F974,Data!$B$36:$B$56,Data!$A$36:$A$56)","v":0},1E-10,97.009999999998769,97.009999999998769]
[null,null,null,null,null,97.109999999998763,{"$f":"cubspline(3,F975,Data!$B$36:$B$56,Data!$A$36:$A$56)","v":0},1E-10,97.109999999998763,97.109999999998763]
[null,null,null,null,null,97.209999999998757,{"$f":"cubspline(3,F976,Data!$B$36:$B$56,Data!$A$36:$A$56)","v":0},1E-10,97.209999999998757,97.209999999998757]
[null,null,null,null,null,97.309999999998752,{"$f":"cubspline(3,F977,Data!$B$36:$B$56,Data!$A$36:$A$56)","v":0},1E-10,97.309999999998752,97.309999999998752]
[null,null,null,null,null,97.409999999998746,{"$f":"cubspline(3,F978,Data!$B$36:$B$56,Data!$A$36:$A$56)","v":0},1E-10,97.409999999998746,97.409999999998746]
[null,null,null,null,null,97.50999999999874,{"$f":"cubspline(3,F979,Data!$B$36:$B$56,Data!$A$36:$A$56)","v":0},1E-10,97.50999999999874,97.50999999999874]
[null,null,null,null,null,97.609999999998735,{"$f":"cubspline(3,F980,Data!$B$36:$B$56,Data!$A$36:$A$56)","v":0},1E-10,97.609999999998735,97.609999999998735]
[null,null,null,null,null,97.709999999998729,{"$f":"cubspline(3,F981,Data!$B$36:$B$56,Data!$A$36:$A$56)","v":0},1E-10,97.709999999998729,97.709999999998729]
[null,null,null,null,null,97.809999999998723,{"$f":"cubspline(3,F982,Data!$B$36:$B$56,Data!$A$36:$A$56)","v":0},1E-10,97.809999999998723,97.809999999998723]
[null,null,null,null,null,97.909999999998718,{"$f":"cubspline(3,F983,Data!$B$36:$B$56,Data!$A$36:$A$56)","v":0},1E-10,97.909999999998718,97.909999999998718]
[null,null,null,null,null,98.009999999998712,{"$f":"cubspline(3,F984,Data!$B$36:$B$56,Data!$A$36:$A$56)","v":0},1E-10,98.009999999998712,98.009999999998712]
[null,null,null,null,null,98.109999999998706,{"$f":"cubspline(3,F985,Data!$B$36:$B$56,Data!$A$36:$A$56)","v":0},1E-10,98.109999999998706,98.109999999998706]
[null,null,null,null,null,98.209999999998701,{"$f":"cubspline(3,F986,Data!$B$36:$B$56,Data!$A$36:$A$56)","v":0},1E-10,98.209999999998701,98.209999999998701]
[null,null,null,null,null,98.309999999998695,{"$f":"cubspline(3,F987,Data!$B$36:$B$56,Data!$A$36:$A$56)","v":0},1E-10,98.309999999998695,98.309999999998695]
[null,null,null,null,null,98.409999999998689,{"$f":"cubspline(3,F988,Data!$B$36:$B$56,Data!$A$36:$A$56)","v":0},1E-10,98.409999999998689,98.409999999998689]
[null,null,null,null,null,98.509999999998684,{"$f":"cubspline(3,F989,Data!$B$36:$B$56,Data!$A$36:$A$56)","v":0},1E-10,98.509999999998684,98.509999999998684]
[null,null,null,null,null,98.609999999998678,{"$f":"cubspline(3,F990,Data!$B$36:$B$56,Data!$A$36:$A$56)","v":0},1E-10,98.609999999998678,98.609999999998678]
[null,null,null,null,null,98.709999999998672,{"$f":"cubspline(3,F991,Data!$B$36:$B$56,Data!$A$36:$A$56)","v":0},1E-10,98.709999999998672,98.709999999998672]
[null,null,null,null,null,98.809999999998666,{"$f":"cubspline(3,F992,Data!$B$36:$B$56,Data!$A$36:$A$56)","v":0},1E-10,98.809999999998666,98.809999999998666]
[null,null,null,null,null,98.909999999998661,{"$f":"cubspline(3,F993,Data!$B$36:$B$56,Data!$A$36:$A$56)","v":0},1E-10,98.909999999998661,98.909999999998661]
[null,null,null,null,null,99.009999999998655,{"$f":"cubspline(3,F994,Data!$B$36:$B$56,Data!$A$36:$A$56)","v":0},1E-10,99.009999999998655,99.009999999998655]
[null,null,null,null,null,99.109999999998649,{"$f":"cubspline(3,F995,Data!$B$36:$B$56,Data!$A$36:$A$56)","v":0},1E-10,99.109999999998649,99.109999999998649]
[null,null,null,null,null,99.209999999998644,{"$f":"cubspline(3,F996,Data!$B$36:$B$56,Data!$A$36:$A$56)","v":0},1E-10,99.209999999998644,99.209999999998644]
[null,null,null,null,null,99.309999999998638,{"$f":"cubspline(3,F997,Data!$B$36:$B$56,Data!$A$36:$A$56)","v":0},1E-10,99.309999999998638,99.309999999998638]
[null,null,null,null,null,99.409999999998632,{"$f":"cubspline(3,F998,Data!$B$36:$B$56,Data!$A$36:$A$56)","v":0},1E-10,99.409999999998632,99.409999999998632]
[null,null,null,null,null,99.509999999998627,{"$f":"cubspline(3,F999,Data!$B$36:$B$56,Data!$A$36:$A$56)","v":0},1E-10,99.509999999998627,99.509999999998627]
[null,null,null,null,null,99.609999999998621,{"$f":"cubspline(3,F1000,Data!$B$36:$B$56,Data!$A$36:$A$56)","v":0},1E-10,99.609999999998621,99.609999999998621]
[null,null,null,null,null,99.709999999998615,{"$f":"cubspline(3,F1001,Data!$B$36:$B$56,Data!$A$36:$A$56)","v":0},1E-10,99.709999999998615,99.709999999998615]
[null,null,null,null,null,99.80999999999861,{"$f":"cubspline(3,F1002,Data!$B$36:$B$56,Data!$A$36:$A$56)","v":0},1E-10,99.80999999999861,99.80999999999861]
[null,null,null,null,null,99.909999999998604,{"$f":"cubspline(3,F1003,Data!$B$36:$B$56,Data!$A$36:$A$56)","v":0},1E-10,99.909999999998604,99.909999999998604]
[null,null,null,null,null,100.0099999999986,{"$f":"cubspline(3,F1004,Data!$B$36:$B$56,Data!$A$36:$A$56)","v":0},1E-10,100.0099999999986,100.0099999999986]